Age,Hospital,Sessions attended,Did not attend (N),Unable to attend (N),Sex (M-1 F-2),COPD (Y- 1o N- 0),Fibrosis (Y-1 N-0),Bro'ectasis (Y-1 N-0),Kyph (Y-1 N-0),Chronic Asthma (Y-1 N-0),Other lung disease (Y-1 N-0),BMI kg/m2,FEV1(% pred),ISWT Pre PRP,ISWT Post PRP,ISWT 6/12 mths,ISWT 12/12 mths,Anxiety score Pre PRP,Anxiety score Post PRP,Anxiety score 6/12 mths,Anxiety score 12/12 mths,Depression score Pre PRP,Depression score post PRP,Depression score 6/12 mths,Depression score 12/12 mths,SGRQ Pre PRP Total ,SGRQ Post PRP Total,SGRQ 6/12 Total ,SGRQ 12/12 Tot Score,MRC score pre PRP,MRC score post PRP,6 mths Pre PRP Admission no,6 mths pre PRP Days in hospital,6 mths post PRP Admission no,6 mths Post PRP days in hospital,12 mths pre PRP admission no,12 mths pre PRP days in hospital,12 mths post PRP admission no,12 mths post PRP days in hospital,,,
44,1,16,0,2,1,1,0,0,0,0,0,25,,260,250,0,220,13,12,15,12,7,9,8,3,68.72,74.22,68.93,71.43,,,0,0,0,0,0,0,1,18,,,
75,1,17,0,1,2,1,0,0,0,0,0,17.5,,220,250,,,8,3,,,1,1,,,19.44,28.89,,,,,0,0,0,0,1,6,2,60,,,
61,1,18,0,0,1,1,0,0,0,0,0,30,,240,380,360,,3,1,6,,5,2,4,,55.64,35.19,39.71,,,,0,0,0,0,1,10,0,0,,,
83,1,18,0,0,1,1,0,0,0,0,1,29,,20,100,10,30,6,10,11,10,12,6,8,12,78.36,79.25,77.7,56.65,,,0,0,0,0,1,6,0,0,,,
48,1,16,0,2,2,1,0,0,0,0,0,15,,140,140,,,16,16,,,14,9,,,89.04,84.62,,,,,0,0,0,0,1,4,0,0,,,
69,1,1,10,7,2,1,0,1,0,1,0,32.7,76,100,130,,,8,5,,,5,6,,,70.75,64.72,,,,,0,0,0,0,,,,,,,
61,1,8,10,0,1,1,0,0,0,0,0,24,,230,,,,14,,,,10,,,,71.27,,,,,,2,2,0,0,4,5,1,2,,,
51,1,2,6,10,1,,,,,,,,,,,,,,,,,,,,,85.22,,,,,,,,,,,,,,,,
65,1,6,6,6,2,1,0,0,0,0,0,22,,40,100,,,17,13,,,10,12,,,68.8,72.65,,,,,,,,,,,,,,,
57,1,13,0,5,2,,,,,,,19.5,,190,,,,7,,,,4,,,,74.24,,,,,,4,19,1,10,8,88,4,44,,,
53,2,0,0,9,1,1,0,0,0,0,0,55.3,57,180,210,180,190,8,2,6,3,6,4,6,3,70.98,42.8,47.29,41.52,,,1,13,0,0,1,13,0,0,,,
68,2,13,0,5,2,1,0,0,0,0,0,29.3,37,210,240,150,230,5,6,7,4,7,8,7,3,31.38,33.66,43.53,24.67,3,3,0,0,0,0,0,0,0,0,,,
67,2,15,3,2,2,1,0,0,0,0,0,36.7,76,80,180,,,16,14,,,9,8,,,69.3,61.57,,,5,,0,0,0,0,1,4,0,0,,,
58,2,16,2,1,1,1,0,0,0,0,0,26.9,32,0,0,,,3,4,,,5,4,,,49.5,48.78,52.91,49.69,3,,1,1,0,0,2,4,0,0,,,
57,2,16,2,1,2,0,0,1,0,0,0,31.96,68,360,440,430,,8,12,10,12,4,8,6,6,49.46,44.23,47.13,61.58,,,0,0,0,0,0,0,0,0,,,
54,2,6,4,8,2,1,0,0,0,1,0,21.3,40,40,80,,,4,2,,,10,5,,,,,,,5,,0,0,0,0,,,,,,,
67,2,2,6,10,1,1,0,1,0,0,0,21.3,20,170,,,,4,,,,8,,,,72.25,,,,,,1,15,3,22,2,16,7,69,,,
62,2,4,11,3,1,1,0,0,0,0,0,24,15,70,,,,11,,,,10,,,,73.04,,,,5,,0,0,0,0,,,,,,,
59,2,1,16,1,2,0,0,1,0,0,0,36,48,80,,,,4,,,,0,,,,61.8,,,,,,0,0,1,2,2,2,1,1,,,
54,2,6,6,6,2,1,0,0,0,0,0,19.4,27,,,,,6,,,,11,,,,95.2,,,,3,,1,15,0,0,1,15,1,3,,,
65,1,17,1,0,2,1,0,0,0,0,0,33.2,42,50,80,70,80,9,13,9,10,11,9,11,10,73.51,70.77,74.29,69.58,4,5,0,0,0,0,0,0,0,0,,,
70,1,16,0,2,2,1,0,1,0,0,0,26,30,220,310,340,220,4,3,3,6,8,5,4,7,69.47,41.87,41.77,47.1,5,1,1,3,0,0,2,4,0,0,,,
68,1,16,0,2,1,0,0,0,0,0,0,24.4,74,120,180,170,120,10,6,7,7,3,5,4,2,68.68,63.26,55.49,50.33,4,4,0,0,0,0,0,0,0,0,,,
67,1,13,0,5,1,0,0,0,0,0,1,28,47,50,80,,,16,14,,,11,10,,,86.77,73.96,,,3,4,1,5,0,0,1,4,0,0,,,
73,1,0,0,16,1,0,0,0,0,0,0,28,,30,130,,,12,14,,,15,14,,,74.26,70.09,,,5,,3,26,2,3,,,,,,,
51,1,3,0,15,1,0,0,0,0,0,0,28,20,30,,,,13,,,,16,,,,86.68,,,,5,,0,0,1,9,1,8,2,10,,,
60,1,13,0,5,2,1,0,0,0,0,0,25,27,130,140,120,50,,12,10,12,,12,4,8,,67.47,79.05,76.68,5,3,0,0,2,12,0,0,2,11,,,
69,1,11,0,7,2,1,0,0,0,1,0,32.7,51,110,150,,,6,5,,,8,6,,,64.72,71.48,,,3,4,0,0,0,0,0,0,0,0,,,
63,1,16,0,2,2,1,0,0,0,0,0,25.2,49,0,50,20,20,13,4,4,5,6,3,6,8,65.7,50.85,42.14,50.59,5,3,0,0,0,0,0,0,0,0,,,
70,1,14,0,4,2,1,0,0,0,0,0,28.4,43,220,290,120,110,21,19,16,2,8,3,4,1,50.54,39.36,43.75,50.76,4,1,0,0,1,2,0,0,1,2,,,
52,1,18,0,0,2,0,0,0,0,1,0,30.9,76,420,540,540,640,3,2,5,2,7,3,7,2,69.5,67.12,75.42,75.9,3,2,0,0,0,0,0,0,0,0,,,
61,1,18,0,0,2,1,0,0,0,1,0,28,48,80,180,40,20,12,14,16,16,8,7,6,7,72.11,60.05,68.91,76.3,4,3,3,23,0,0,9,34,4,15,,,
66,1,17,0,1,2,1,0,0,0,0,1,27.9,14,40,90,,,6,7,,,7,7,,,61.1,57.02,,,,,3,37,3,10,3,37,3,7,,,
67,1,18,0,0,1,0,0,0,0,0,1,30,,80,120,,,5,4,,,5,4,,,53.27,46.71,,,3,3,0,0,2,11,0,0,2,10,,,
68,1,0,15,3,1,1,0,0,0,0,0,19.5,,690,,,,13,,,,5,,,,50.02,,,,,,0,0,2,6,0,0,2,6,,,
73,1,16,0,2,1,0,0,0,0,1,0,28,35,30,120,,,13,,,,15,,,,73.96,78.1,,,,,3,25,2,3,2,17,2,2,,,
55,1,13,0,5,2,0,0,1,0,0,0,16,33,160,,,,8,,,,8,,,,91.06,,,,3,,1,20,1,6,,22,1,6,,,
64,1,16,0,2,2,1,0,0,0,0,0,22,32,40,90,,,17,13,,,10,12,,,68.8,72.68,,,,,0,0,0,0,0,0,0,0,,,
60,1,18,0,0,2,0,0,1,0,0,1,32.8,,90,290,,,4,4,9,10,7,7,8,11,66.38,63.92,58.14,60.03,3,3,1,12,0,0,2,21,0,0,,,
76,1,18,0,0,2,0,0,0,0,1,0,26,,100,190,210,120,7,13,13,,5,9,9,,64.55,80.1,73.08,,3,,0,0,0,0,0,0,0,0,,,
63,2,2,10,6,2,1,0,0,0,0,0,26,,250,,,,13,,,,11,,,,54.51,,,,4,,1,13,1,11,1,13,3,23,,,
74,2,17,0,1,2,1,0,0,0,0,0,,38,100,260,,,8,9,,,9,8,,,76.04,66,,,,,1,7,0,0,2,9,2,9,,,
72,2,18,0,0,1,1,0,0,0,0,0,32,28,50,100,20,,6,4,4,,9,10,5,,57.56,55.18,69.71,,,5,0,0,0,0,0,0,1,13,,,
73,22,0,3,15,2,1,0,0,0,0,0,22,34,50,,,,10,,,,10,,,,83.57,,,,,,0,0,0,0,0,0,0,0,,,
71,2,16,0,2,1,0,0,1,0,1,0,23,34,320,440,440,370,5,3,4,4,5,4,2,2,35.57,31,29.23,28.67,4,3,0,0,4,12,2,15,6,28,,,
73,2,15,0,3,1,1,0,0,0,0,0,27,41,440,540,460,450,4,1,3,5,4,6,6,2,39.05,37.87,37.49,31.94,3,,0,0,0,0,0,0,0,0,,,
63,2,12,0,6,2,1,0,0,0,0,0,27,19,120,130,90,80,4,6,9,9,3,14,12,12,64.98,63.37,74.69,83.29,5,,1,9,0,0,1,9,0,0,,,
70,2,18,0,0,1,0,0,0,0,1,0,28,72,270,430,370,,14,11,13,,9,8,8,,50.99,56.36,75.18,,2,3,0,0,0,0,0,0,0,0,,,
54,2,11,1,4,2,1,0,0,0,0,1,17,38,30,60,70,60,4,8,2,6,10,13,5,4,76.41,77.09,66.73,64.55,5,,1,7,0,0,1,4,0,0,,,
74,2,9,0,9,2,1,0,0,0,0,0,19,43,230,,,,1,,,,5,,,,47.46,,,,4,,0,0,4,23,0,0,4,23,,,
81,2,18,0,0,1,1,0,0,0,0,0,25.8,39,130,160,140,,6,7,1,,11,8,3,,20.98,17.96,17.69,,4,,2,6,0,0,2,3,0,0,,,
66,2,18,0,0,1,1,0,0,0,0,0,35,29,120,210,190,,10,5,2,,7,7,5,,78.91,68.44,39.21,,5,,0,0,0,0,0,0,2,2,,,
67,2,18,0,0,1,1,0,0,0,0,0,27,33,230,480,,,13,10,,,8,10,,,66.19,56.89,,,4,,3,30,1,2,3,8,1,2,,,
67,2,18,0,0,1,1,0,0,0,0,0,22,78,650,810,700,670,8,11,7,2,3,5,2,1,19.23,30.41,35.59,27.33,,,2,7,0,0,2,6,1,1,,,
49,2,16,0,2,1,1,0,0,0,0,0,24.5,40,70,140,,  ,13,12,,,8,10,,,77.14,74.48,,,,,0,0,0,0,0,0,0,0,,,
74,2,16,0,0,1,1,0,0,0,0,0,25,31,120,180,,90,3,3,,3,7,5,,5,35080,50.65,,31.41,,,0,0,0,0,0,0,0,0,,,
61,2,11,1,6,2,1,0,0,0,0,0,21,24,170,0,,,5,7,,,0,4,,,44.19,65.27,,,3,,0,0,4,31,0,0,5,38,,,
60,2,1,11,6,1,1,0,0,0,0,0,,46,140,,,,13,,,,9,,,,80.74,,,,4,,0,0,0,0,0,0,0,0,,,
74,2,17,0,0,2,1,0,0,0,0,0,23.4,41,50,80,,60,16,7,,9,6,6,,6,74.52,59.24,,58.14,,,0,0,0,0,0,0,0,0,,,
63,2,0,18,0,1,1,0,0,0,0,0,,27,40,,,,11,,,,7,,,,50.84,,,,,,0,0,1,6,0,0,1,5,,,
62,2,0,18,0,1,,,,,,,,,,,,,,,,,,,,,,,,,,,2,23,1,22,2,22,1,22,,,
76,2,18,0,0,2,1,0,1,0,0,0,23,41,210,340,330,,1,2,1,,3,2,1,,48.71,45.16,51.73,,5,,0,0,0,0,0,0,0,0,,,
58,1,17,0,1,1,1,0,0,0,0,0,24.6,37,40,70,140,200,2,2,3,0,3,1,5,1,73.07,60.36,65.32,56.25,3,,2,4,0,0,2,3,0,0,,,
51,1,15,1,2,1,0,0,0,0,0,0,21,17,0,0,0,0,12,5,3,8,7,5,3,9,69.86,53.04,53.88,76.52,4,3,0,0,0,0,0,0,1,1,,,
77,1,12,0,6,2,0,0,1,0,0,0,24.3,63,0,0,0,0,15,14,10,4,8,10,3,6,93.82,50.16,75.13,54.97,,,0,0,0,0,6,6,0,0,,,
80,1,17,0,1,1,0,0,1,0,0,0,25.1,,0,60,40,50,7,14,17,9,10,7,13,8,75.81,62.16,74.81,71.48,4,,1,20,2,29,1,20,2,19,,,
65,1,13,1,4,2,1,0,0,0,0,0,23.2,29,190,280,230,280,14,17,14,17,13,11,7,5,67.73,74.59,70.79,68.69,,,0,0,0,0,0,0,0,0,,,
40,1,16,0,2,2,0,0,0,0,1,0,40,51,100,200,200,120,12,15,12,13,15,15,14,15,76.2,64.46,66.06,80.55,3,,1,1,0,0,1,1,0,0,,,
63,1,8,4,6,1,0,0,0,0,1,0,24,23,260,,,,9,,,,5,,,,71.12,,,,4,,1,4,0,0,1,4,1,4,,,
46,1,10,1,7,1,0,0,0,0,1,0,30.9,15,40,,,,15,,,,15,,,,80.22,,,,3,,0,0,0,0,0,0,0,0,,,
70,1,2,12,4,1,1,0,0,0,0,0,,29,0,,,,19,,,,15,,,,95.45,,,,,,0,0,0,0,1,21,0,0,,,
83,1,4,4,10,2,0,0,0,0,1,0,,,200,,,,0,,,,,,,,48.36,,,,,,0,0,0,0,0,0,1,3,,,
65,1,0,18,0,2,,,,,,,,,,,,,,,,,,,,,,,,,,,9,181,0,0,9,181,1,5,,,
50,1,4,0,14,2,1,0,0,0,0,0,32.2,39,,,,,,,,,,,,,,,,,,,4,11,0,0,5,11,0,0,,,
84,1,0,16,2,2,1,0,0,0,0,0,43.1,59,0,,,,10,,,,12,,,,78.46,,,,,,4,61,2,67,5,71,4,140,,,
82,1,18,0,0,2,1,0,0,0,0,0,25.1,,80,130,110,40,1,0,1,1,3,2,3,4,47.1,49.36,48.63,46.3,3,3,1,4,1,2,2,14,1,2,,,
62,1,13,0,4,2,1,0,0,0,0,0,27.8,22,0,250,230,280,8,7,1,7,2,5,2,3,55.7,51.62,29.44,36.37,3,2,0,0,5,40,3,13,5,40,,,
59,1,16,0,2,2,0,0,1,0,1,0,28.3,41,250,290,190,270,9,8,12,14,10,5,11,8,68.33,65.61,72.67,50.21,2,1,1,6,2,15,2,11,2,15,,,
73,1,10,3,5,2,0,0,1,0,0,0,23.4,65,10,,,,5,3,,,7,7,,,73.36,55.27,85.17,,,,4,46,3,18,4,46,4,27,,,
56,1,0,5,,2,1,0,0,0,0,0,39,,70,130,100,140,13,13,12,12,12,9,14,14,73.36,55.27,51.07,72.11,4,3,1,2,3,6,1,2,4,7,,,
65,1,6,4,8,1,,,,,,,28.5,,,,,,,,,,,,,,63.51,,,,,,0,0,0,0,0,0,0,0,,,
73,1,2,12,4,1,1,0,0,0,0,0,24.1,24,80,,,,4,,,,10,,,,67.26,,,,,,1,3,2,10,3,13,3,13,,,
62,1,15,0,3,1,1,0,0,0,0,0,31,53,80,190,200,,1,3,1,,5,4,8,,45.91,29.25,47.75,,,,0,0,0,0,0,0,0,0,,,
53,1,2,6,10,1,,,,,,,,,,,,,,,,,,,,,85.22,,,,,,1,8,1,1,1,9,1,1,,,
68,1,9,3,12,2,1,0,0,0,0,0,30.2,26,70,,,,7,,,,12,,,,81.04,,,,,,1,8,2,16,1,9,2,19,,,
80,2,17,0,1,1,1,0,0,0,0,0,30,58,70,140,,,2,2,0,,4,3,1,,67.25,63.56,57.95,,5,5,0,0,0,0,2,6,0,0,,,
77,2,18,0,0,2,1,0,0,0,0,0,,31,70,170,180,,5,6,5,5,6,2,1,2,58.77,35.67,37.54,47.8,4,4,0,0,0,0,0,0,0,0,,,
60,2,18,0,0,2,1,0,0,0,0,0,31,63,270,380,290,,12,8,9,,9,5,7,,46.58,47.39,63.36,,,3,0,0,0,0,0,0,0,0,,,
65,2,18,0,0,2,1,0,0,0,0,0,26,75,60,250,200,,18,15,9,13,8,5,5,5,55.04,58.04,57.19,62.55,3,2,0,0,0,0,0,0,0,0,,,
57,2,16,0,2,1,1,0,0,0,0,0,26.8,24,340,550,,,7,5,,14,5,3,,11,65.61,43.06,,61.63,5,3,0,0,0,0,0,0,0,0,,,
64,2,1,16,1,1,1,0,0,0,0,0,24,61,300,,,,7,,,,8,,,,51.91,,,,,,2,13,0,0,2,13,1,3,,,
49,2,18,0,0,1,1,0,0,0,1,0,32.7,40,430,520,,,1,2,3,4,0,1,4,1,34.35,24.89,23.94,34.74,2,2,0,0,0,0,0,0,0,0,,,
81,2,0,4,4,2,1,0,0,0,1,0,,21,40,80,,,1,0,,,1,1,,,30.82,40.75,,,3,3,0,0,0,0,0,0,1,13,,,
64,2,1,16,1,1,1,0,0,0,0,0,,35,0,0,0,0,8,,,,17,,,,83.42,,,,,,0,0,1,8,0,0,4,54,,,
67,2,1,17,0,1,1,1,0,0,0,0,,31,300,,,,5,,,,5,,,,68.27,,,,,,0,0,0,0,0,0,0,0,,,
60,1,12,0,6,1,1,0,0,0,0,0,22,71,170,270,260,270,18,16,15,11,14,16,14,16,80.72,56.57,68.94,55.83,4,4,0,0,0,0,0,0,,,,,
77,1,16,0,2,1,1,0,0,0,0,0,23.5,29,140,150,60,100,1,0,0,3,7,5,4,2,52.05,49.82,60.74,35.27,4,3,2,5,0,0,3,14,,,,,
70,1,15,0,3,2,1,0,0,0,1,0,24.4,47,140,200,180,150,5,7,6,7,6,10,9,3,71.22,57.6,70.34,63.69,4,4,0,0,0,0,0,0,,,,,
67,1,16,0,2,1,1,0,0,0,0,0,31,88,80,90,80,50,14,11,9,13,8,7,3,8,73.17,64.33,62.73,70.27,5,4,0,0,0,0,0,0,,,,,
71,1,8,0,10,2,1,0,0,0,0,0,24,30,0,0,0,0,10,9,10,4,6,5,4,8,64.17,40.75,68.05,76.34,4,3,0,0,0,0,0,0,,,,,
69,1,13,0,5,1,1,0,0,0,0,0,27,66,120,150,80,120,4,3,3,8,4,2,6,9,60.49,59.87,70.34,70.34,5,4,0,0,0,0,0,0,,,,,
61,1,12,0,6,2,1,1,0,0,0,0,27.2,54,250,350,350,,18,14,7,,17,9,3,,77.67,44.82,63.81,,5,3,5,14,0,0,6,23,,,,,
67,1,10,0,8,2,1,0,0,0,0,0,25,,350,290,,,14,8,,,4,4,,,45.58,53.8,,,2,,3,51,0,0,4,56,,,,,
62,1,11,0,7,2,0,0,0,0,1,0,,64,40,90,40,0,11,8,8,9,11,10,80,12,83.68,68.02,74.13,85.79,5,4,0,0,0,0,0,0,,,,,
60,2,1,9,8,1,1,0,0,0,0,0,19.5,31,170,,,,10,,,,10,,,,79.26,,,,2,,1,39,0,0,4,28,,,,,
65,2,18,0,10,2,0,0,1,0,0,0,,64,440,720,,,14,13,,,11,5,,,67.05,63.05,,,2,2,0,0,0,0,0,0,,,,,
70,2,16,0,2,1,1,0,0,0,0,0,27.6,42,290,350,,,7,4,7,8,2,0,3,1,57.29,38.59,65.46,54.81,2,1,1,8,0,0,1,8,,,,,
63,2,2,4,12,1,0,1,0,0,0,0,,80,40,,,,17,,,,12,,,,64.26,,,,2,,1,6,0,0,1,6,,,,,
64,2,18,0,0,2,0,0,0,0,0,1,,,380,530,,,4,8,10,11,3,9,5,6,26.05,39.57,48.36,42.67,2,2,1,1,0,0,1,1,,,,,
62,2,15,0,3,2,0,0,0,0,1,0,,49,350,560,,,7,5,,,7,5,,,40.76,33.84,,,3,2,0,0,0,0,0,0,,,,,
49,2,0,17,1,2,0,0,0,0,1,0,,68,,,,,,,,,,,,,,,,,,,1,2,0,0,1,2,,,,,
86,2,14,0,4,1,0,1,0,0,0,0,,86,20,,,,11,,,,11,,,,79.43,,,,4,,1,8,1,12,1,8,1,12,,,
56,2,14,0,4,2,1,0,0,0,0,0,27.3,24,210,280,,,4,5,8,6,2,3,4,1,71.29,61.33,63.52,63.76,4,0,0,0,0,0,0,0,,,,,
79,2,10,0,8,1,1,0,0,0,0,0,34.5,35,70,80,,,8,3,,,9,7,,,54.23,59.2,,,4,4,0,0,0,0,3,14,,,,,
64,1,16,0,2,2,1,0,0,0,0,0,25,46,350,560,570,570,4,3,3,7,3,1,1,4,25.44,19.27,28.45,39.5,3,2,1,6,0,0,1,6,0,0,,,
75,1,2,0,16,2,,,,,,,21,,,,,,,,,,,,,,60.51,,,,,,8,48,0,0,8,48,,,,,
63,1,17,0,1,1,1,0,0,0,0,0,38,25,400,400,340,,1,0,0,,1,0,2,,43.83,23.82,31.8,,4,2,1,7,0,0,1,7,,,,,
78,1,11,0,7,2,0,0,0,1,1,0,27,42,8,,,10,7,9,,4,4,9,,8,74,79.29,,65.87,4,4,0,0,0,0,0,0,0,0,,,
55,1,5,11,2,2,1,1,0,0,0,0,,27,80,,,,15,13,,,,,,,87.39,,,,4,,0,0,0,0,0,0,,,,,
69,1,13,0,5,2,1,0,0,0,0,0,,48,200,330,290,290,4,3,6,7,2,1,6,2,29.32,32.13,39.97,48.16,3,2,1,14,0,0,1,14,,,,,
61,1,16,0,2,1,1,0,0,0,0,0,22.5,21,160,280,340,310,8,7,8,2,8,7,8,6,75.45,48.66,72.56,50.15,4,2,0,0,0,0,0,0,2,8,,,
68,1,10,,,2,,,,,,,,,,,,,,,,,,,,,,,,,,,3,24,0,0,3,25,,,,,
79,1,18,0,0,2,1,0,0,0,0,0,30,45,40,80,50,,4,5,5,7,4,5,4,3,48.34,35.14,50.84,62.85,3,3,0,0,0,0,0,0,0,0,,,
66,1,1,16,0,1,1,0,0,0,0,0,,34,,,,,,,,,,,,,,,,,,,2,11,0,0,2,5,,,,,
65,1,10,5,2,2,1,0,0,0,0,0,,,190,,,,8,,,,6,,,,67.82,,,,,,0,0,0,0,0,0,,,,,
68,2,0,7,10,1,0,0,1,0,0,1,31.3,,70,,,,9,,,,7,,,,41.46,,,,2,,2,15,0,0,2,5,,,,,
70,2,9,0,9,2,1,0,0,0,0,0,16.6,31,130,200,,,16,13,,,11,12,,,71.43,68.64,,,3,,0,0,0,0,0,0,,,,,
50,2,12,0,6,2,1,0,0,0,0,0,22.3,48,240,360,350,,5,3,0,,4,8,3,,50.71,58.65,55.62,,2,2,0,0,0,0,0,0,,,,,
66,2,7,0,11,2,1,0,0,0,0,0,20.9,56,100,210,,,15,16,,,4,7,,,55.91,65.66,,,2,,0,0,0,0,0,0,,,,,
69,2,15,0,3,1,1,0,0,0,0,0,27.6,,250,390,360,,6,6,2,,6,4,5,,60.98,57.46,63.53,,4,3,0,0,0,0,0,0,,,,,
57,2,13,0,5,1,1,0,0,0,0,0,18.5,16,140,210,80,,7,4,10,,7,4,5,,74,54.09,73.72,,5,4,1,8,0,0,1,8,,,,,
58,2,14,0,4,2,0,0,0,0,0,1,40.9,,210,340,270,,4,3,2,,3,4,5,,49.3,45.65,49.52,,3,3,0,0,0,0,0,0,,,,,
70,2,16,0,2,2,0,0,0,0,1,0,22,27,180,350,,,5,2,,,8,4,,,63.52,42.27,,,5,,0,0,0,0,0,0,,,,,
78,2,16,0,2,1,1,0,0,0,0,0,17.9,,180,240,200,,6,5,13,,10,3,12,,76.33,45.08,71.36,,3,3,0,0,0,0,0,0,,,,,
61,2,1,7,8,1,1,0,0,0,0,0,30.6,41,350,,,,8,,,,8,,,,61.81,,,,3,,0,0,0,0,0,0,,,,,
58,2,12,1,5,2,0,0,1,0,1,1,23,75,460,540,,,6,8,,,3,3,,,30.99,54.51,,,2,,1,2,0,0,1,2,,,,,
80,2,18,0,0,1,1,0,0,0,0,0,34,47,40,150,100,,8,4,7,,7,4,7,,67.22,59.95,66.56,,4,3,0,0,0,0,0,0,,,,,
69,2,18,0,0,1,1,0,0,0,0,0,28.5,30,50,130,0,0,11,7,9,13,6,4,4,4,79.23,71.72,72.14,86.5,3,3,1,4,0,0,2,8,,,,,
85,2,0,0,18,1,1,0,0,0,0,0,29,51,,,,,,,,,,,,,,,,,,,0,0,0,0,1,35,,,,,
64,2,17,0,1,2,0,0,0,0,1,0,25.4,50,180,300,270,330,9,9,7,4,2,3,2,0,38.38,27.99,34.72,19.36,3,2,0,0,0,0,0,0,,,,,
54,2,0,0,0,2,1,0,0,0,0,1,50.4,56,70,150,,,12,12,,,15,10,,,66.88,59.24,,,3,3,0,0,0,0,0,0,,,,,
56,2,11,0,7,2,1,0,0,0,0,0,18.75,39,190,260,,,16,8,,,12,1,,,72.55,25.41,,,3,2,1,2,0,0,1,2,,,,,
81,2,13,0,5,2,1,0,0,0,0,0,32,64,30,,,,11,,,,10,,,,77.31,,,,3,,1,3,0,0,1,3,,,,,
46,2,0,0,18,2,,,,,,,,,,,,,,,,,,,,,38.07,,,,,,0,0,0,0,0,0,,,,,
67,2,6,0,12,2,1,0,0,0,0,0,29.1,22,60,,,,4,,,,4,,,,63.83,,,,4,,1,25,0,0,1,25,,,,,
79,2,10,0,8,1,1,0,0,0,0,0,23.6,43,50,130,,,3,1,,,6,5,,,58.56,52.05,,,4,2,0,0,0,0,1,4,,,,,
70,2,15,0,3,2,1,0,0,0,0,0,28.5,63,280,340,,,10,4,,,5,2,,,53.77,30.59,,,2,2,0,0,0,0,0,0,,,,,
57,2,9,6,3,2,1,0,0,0,0,0,27.4,,80,,,,14,,,,9,,,,50.15,,,,3,,0,0,0,0,0,0,,,,,
64,2,7,0,11,2,1,0,0,0,0,0,21,30,,,,,11,,,,7,,,,54.63,,,,4,,1,5,0,0,1,6,,,,,
74,2,18,0,,1,1,0,0,0,0,0,42,31,120,190,250,,4,5,8,,3,9,4,,54.11,60.23,48.75,,4,4,0,0,0,0,0,0,,,,,
72,2,,,,1,,,,,,,,,,,,,,,,,,,,,,,,,,,1,14,0,0,3,33,,,,,
73,2,17,0,1,1,1,0,0,0,0,0,25.5,46,300,330,,,4,5,0,,2,1,2,,39.15,38.77,45.47,,3,2,0,0,0,0,1,6,,,,,
57,2,15,0,3,1,1,0,1,0,1,0,31,40,180,550,,,8,1,,,9,2,,,63.12,44.42,,,3,3,0,0,0,0,0,0,,,,,
74,2,9,1,8,2,1,0,0,0,0,0,27.4,50,180,210,,,5,3,4,,2,1,1,,39.06,40.88,39.25,,2,4,1,3,0,0,1,3,,,,,
49,2,14,0,4,2,1,0,0,0,0,0,25,97,270,390,,,17,9,,,9,4,,,62.87,49.23,,,3,2,0,0,0,0,0,0,,,,,
60,2,14,0,4,2,1,0,0,0,0,0,18.5,31,40,170,,,8,6,,,9,2,,,65.94,44.8,,,4,3,0,0,0,0,0,0,,,,,
71,2,12,0,6,2,0,0,0,0,1,0,30.8,102,200,340,,,12,8,,,5,2,,,54.61,55.02,,,3,3,0,0,0,0,1,2,,,,,
64,2,, ,,2,0,0,1,0,0,0,26.9,40,,,,,7,,,,5,,,,,,,,4,,0,0,0,0,0,0,,,,,
73,2,13,0,5,2,1,0,0,0,0,0,27.4,33,130,200,,,14,11,,,16,7,,,72.89,75.23,,,5,2,2,3,0,0,5,23,,,,,
71,2,17,0,1,2,1,0,0,0,0,0,28.4,33,100,130,,,7,6,,,11,7,,,66.16,71.5,,,5,4,1,16,0,0,1,16,,,,,
72,2,11,0,7,1,1,0,0,0,0,0,32.5,,130,180,,,9,6,,,10,8,,,57.2,59.44,62.49,,4,3,1,8,,,1,9,,,,,
56,1,2,14,2,1,1,0,0,0,0,0,36,59,50,,,,19,,,,8,,,,76.17,,,,3,,0,0,,,1,10,,,,,
73,1,17,0,1,2,0,0,0,0,1,0,35,40,140,190,180,,8,3,2,,6,6,4,,76.84,49.42,25.06,,4,4,1,11,,,1,11,,,,,
78,1,12,0,6,1,1,0,0,0,0,0,31.8,33,260,360,,,6,5,,,2,5,,,53.68,53.66,,,3,2,1,2,,,1,2,,,,,
67,1,12,0,6,2,1,0,0,0,0,0,29,37,70,120,,,16,8,,,10,8,,,78.31,57.61,,,4,3,1,1,,,1,1,,,,,
73,1,16,0,2,2,1,0,0,0,0,0,27.8,50,120,190,220,,5,6,7,,3,2,2,,55.69,53.79,46.29,,3,3,0,0,,,0,0,,,,,
62,1,16,0,2,1,1,0,0,0,0,0,24,18,80,90,90,,6,7,6,,7,6,6,,66.21,60.36,59.85,,4,4,1,23,,,2,2,,,,,
80,1,15,0,3,2,1,0,0,0,0,0,29,38,130,220,,,7,5,,,9,11,,,61.05,66.71,,,4,3,1,3,,,1,3,,,,,
61,1,3,0,15,2,0,0,1,0,0,0,,,200,,,,7,,,,5,,,,51.86,,,,,,0,0,,,0,0,,,,,
77,1,13,0,5,1,1,0,0,0,0,0,21,62,220,260,210,,10,8,3,,7,10,8,,62.4,40.76,65.68,,4,3,0,0,,,0,0,,,,,
60,1,14,0,4,1,0,0,0,0,0,1,29.7,78,270,350,,,7,7,,,5,4,,,61.49,56.18,,,3,3,0,0,,,1,3,,,,,
74,1,13,0,5,2,0,1,0,0,0,0,,75,150,160,150,,9,15,11,,4,9,10,,74,76.03,67.64,,3,2,1,17,,,3,21,,,,,
60,1,16,1,1,1,0,0,1,0,0,0, ,85,90,230,,,8,1,,,7,3,,,78.58,42.9,,,4,3,1,3,,,1,3,1,2,,,
71,1,17,0,1,2,1,0,0,0,0,0,26,63,350,370,,,7,5,10,,3,1,9,,42.97,24.69,42.11,,3,2,0,0,,,1,9,,,,,
63,1,17,0,1,1,1,0,0,0,0,0,24.5,29,120,240,280,,9,5,9,,12,5,9,,65.63,64.64,60.66,,4,3,0,0,,,0,0,,,,,
63,1,1,16,17,2,1,0,0,0,0,0,,,120,,,,14,,,,9,,,,70.27,,,,3,,2,15,,,3,20,,,,,
66,1,17,0,1,1,0,0,0,0,0,0,,47,250,270,250,,2,4,1,,3,2,4,,47.83,48.22,38.41,,3,2,2,3,,,2,3,,,,,
79,1,17,0,1,1,1,0,0,0,0,1,28,66,190,360,350,,4,5,8,,2,4,9,,57.82,29.51,47.14,,3,2,0,0,,,0,0,,,,,
69,1,18,0,0,1,1,0,0,0,0,0,,19,150,250,180,,13,10,13,,12,7,10,,65.14,47.11,79.03,,3,2,3,22,,,3,22,,,,,
56,1,14,0,4,1,1,0,0,0,0,0,20.5,17,480,420,,,7,7,7,,7,8,6,,53.15,32.05,51.6,,3,2,2,6,,,3,9,,,,,
63,1,3,9,6,2,1,0,0,0,0,0,17.8,48,250,,,,3,,,,6,,,,55.45,,,,3,,1,1,,,1,1,,,,,
78,1,16,0,2,1,1,0,0,0,0,0,,,180,300,270,,10,8,9,,6,6,9,,70.12,44.15,57.83,,3,2,1,6,,,1,6,,,,,
68,1,12,0,6,1,1,0,0,0,0,0,33,29,140,180,,,8,15,15,,6,5,6,,66.8,61.22,68.01,,4,2,0,0,,,0,0,,,,,
78,1,4,,12,2,,,,,,,,,,,,,,,,,,,,,,,,,,,0,0,,,0,0,,,,,
61,1,12,,,2,0,0,0,0,1,0,22.5,96,90,140,120,,5,1,2,,5,5,4,,57.15,61.24,40.49,,4,3,0,0,,,3,43,,,,,
69,1,,,,1,1,0,0,0,0,0,36.5,51,100,,,,4,,,,9,,,,67.03,,,,5,,1,8,,,1,8,,,,,
54,1,18,0,1,1,0,1,1,0,0,0,24.5,61,130,200,210,,13,12,9,,5,2,4,,74.84,70.4,73,,4,3,0,0,,,0,0,,,,,
64,1,12,0,7,2,1,0,0,0,0,0,33,50,270,310,,,15,10,,,9,2,,,48.83,51.31,,,4,2,0,0,,,1,6,,,,,
74,1,16,0,3,1,1,0,0,0,0,0,,38,240,210,,,12,15,,,15,11,,,85.1,68.13,,,2,4,0,0,,,0,0,,,,,
58,1,13,0,6,1,1,0,0,0,0,0,16.5,32,250,290,,,9,7,,,4,4,,,80.72,54.29,,,4,2,2,8,,,3,15,,,,,
40,1,7,0,12,2,0,0,0,0,1,0,,72,5,7,,,16,16,,,18,15,,,77.36,78.04,,,5,5,0,0,,,0,0,,,,,
70,1,19,0,0,1,0,0,0,0,1,0,31,88,260,340,,,7,5,,,3,1,,,51.61,20.39,,,3,,0,0,,,0,0,,,,,
65,1,14,0,5,1,1,0,0,0,0,0,22,53,90,440,330,,13,13,10,,9,11,9,,79.85,88.79,84.94,,4,2,0,0,,,0,0,,,,,
69,1,,,,1,0,0,1,0,1,0,31,53,150,,,,13,,,,6,,,,77.97,,,,3,,0,0,,,0,0,,,,,
78,1,18,0,1,2,1,0,0,0,0,0,,50,70,130,90,,14,11,5,,6,5,2,,61.15,51.87,50.77,,4,3,1,9,,,1,9,,,,,
63,2,17,0,1,2,0,0,1,0,0,0,25.1,,270,440,,,10,9,,,11,4,,,72.76,40.79,,,3,3,0,0,,,0,0,,,,,
71,2,18,0,0,2,1,0,0,0,0,0,26.8,43,130,250,,,9,9,,,8,2,,,75.23,55.3,,,3,3,,,,,,,,,,,
71,2,7,0,11,1,1,0,0,0,0,0,22.6,25,340,370,,,5,10,,,4,5,,,43.13,38.81,,,4,2,0,0,,,0,0,,,,,
62,2,11,0,7,2,1,0,0,0,0,0,21.8,32,550,570,,,8,7,,,9,7,,,40.05,17.53,,,3,1,2,5,,,2,5,,,,,
64,2,14,0,4,1,1,0,0,0,0,0,24.1,24,40,150,,,14,7,,,10,6,,,76.49,71.12,,,5,4,0,0,,,0,0,,,,,
53,2,12,0,6,2,1,0,0,0,0,0,35.4,43,260,420,,,7,7,,,9,7,,,74.64,58.51,,,4,3,0,0,,,0,0,,,,,
67,2,13,0,5,2,0,1,0,0,0,0,35.9,63,110,130,,,11,7,,,6,2,,,56.67,60.33,,,4,3,0,0,,,0,0,,,,,
78,2,16,0,2,2,1,0,0,0,0,0,22.9,34,330,420,,,3,8,,,3,6,,,50.27,45.68,,,3,2,0,0,,,0,0,,,,,
74,2,6,10,2,2,1,0,0,0,0,0,,53,150,,,,13,,,,13,,,,,,,,3,,,,,,,,,,,,
79,2,2,5,11,2,1,0,0,0,0,0,,44,,,,,,,,,,,,,,,,,,,,,,,,,,,,,
57,2,15,0,3,1,1,0,0,0,0,0,34,64,130,270,,,10,7,,,7,7,,,68.63,60.95,,,4,3,,,,,,,,,,,
72,2,3,3,12,1,1,0,1,0,0,0,,24,,,,,,,,,,,,,,,,,,,,,,,,,,,,,
51,1,16,1,1,1,1,0,0,0,0,0,24.5,28,50,40,,,13,16,,,15,17,,,86.76,94.89,,,4,3,2,3,,,2,3,,,,,
79,1,17,0,1,2,0,0,0,0,1,0,36.5,96,80,90,,,1,1,,,3,3,,,66.76,57.02,,,3,3,0,0,,,0,0,,,,,
59,1,,,,2,0,0,0,0,1,0,32,80,80,,,,7,,,,5,,,,77.26,,,,3,,0,0,,,0,0,,,,,
66,1,15,0,3,1,1,1,0,0,0,0,25.7,75,110,120,,,11,15,,,11,16,,,66.03,,,,2,,1,17,,,1,17,,,,,
74,1,15,0,3,2,0,0,0,0,1,0,27,68,360,480,,,6,5,,,3,0,,,38.68,31.41,,,2,2,0,0,,,0,0,,,,,
56,1,5,1,12,1,1,0,0,1,0,0,35,29,70,,,,3,,,,3,,,,53.89,,,,5,,0,0,,,0,0,,,,,
87,1,11,0,7,1,1,0,0,0,0,0,25.5,32,20,40,,,7,12,,,7,4,,,38.27,35.83,,,5,3,2,15,,,2,15,,,,,
59,1,14,0,4,2,1,0,0,0,0,0,31,33,140,190,,,8,8,,,4,0,,,74.12,69.57,,,3,2,0,0,,,0,0,,,,,
55,1,3,1,14,1,1,0,0,0,0,0,33.2,39,350,,,,11,,,,8,,,,84.29,,,,4,,,,,,,,,,,,
58,1,11,0,7,2,0,0,1,0,1,0,30,85,140,140,,,5,3,,,3,0,,,55.42,38.84,,,3,2,0,0,,,0,0,,,,,
69,1,,,,1,0,0,1,0,1,0,31,61,220,270,,,13,10,,,12,11,,,88.03,54.92,,,3,2,,,,,,,,,,,
73,2,,,,1,1,1,0,0,0,0,,,70,,,,0,,,,4,,,,33.27,,,,2,,1,7,,,1,7,,,,,
74,2,,,,1,0,0,0,0,0,1,,,220,,,,2,,,,5,,,,39.13,,,,3,,0,0,,,0,0,,,,,
78,2,,,,1,1,0,0,0,0,0,,36,150,,,,2,,,,0,,,,48.74,,,,3,,2,7,,,4,17,,,,,
67,2,,,,2,1,0,0,0,1,0,,33,120,,,,9,,,,6,,,,56.67,,,,3,,1,2,,,1,2,,,,,
72,2,,,,1,1,0,0,0,0,0,,76,30,,,,16,,,,12,,,,79.45,,,,4,,0,0,,,0,0,,,,,
77,2,,,,1,1,0,0,0,0,1,,47,70,,,,12,,,,11,,,,87.45,,,,4,,0,0,,,0,0,,,,,
53,2,,,,1,1,0,0,0,0,1,,20,20,,,,10,,,,10,,,,81.92,,,,5,,0,0,,,0,0,,,,,
48,2,,,,2,1,0,0,0,0,1,,86,60,,,,0,,,,7,,,,54.73,,,,4,,0,0,,,0,0,,,,,
47,2,,,,2,1,0,0,0,0,0,33.8,67,340,,,,14,,,,5,,,,27.97,,,,2,,0,0,,,0,0,,,,,
73,2,,,,2,1,0,0,0,1,0,31.9,30,100,170,,,4,0,,,10,1,,,51.03,44.86,,,3,3,0,0,,,1,2,,,,,
72,2,,,,1,1,0,0,0,0,0,28.8,68,30,80,,,14,11,,,10,7,,,71.35,71.53,,,,,,,,,,,,,,,
56,2,,,,1,0,0,0,0,1,0,27.7,46,440,530,,,2,1,,,1,0,,,58.42,57.73,,,,,0,0,,,0,0,,,,,
62,2,,,,2,1,0,0,0,0,0,19,,160,270,,,11,9,,,5,6,,,68.9,71.56,,,,,0,0,,,1,16,,,,,
59,2,,,,1,1,0,0,0,1,0,32.25,,40,70,,,8,3,,,4,0,,,66.56,45.23,,,5,4,0,0,,,0,0,,,,,
89,2,,,,1,1,0,0,0,0,1,23.5,,180,280,,,0,0,,,0,2,,,34.65,29.96,,,,,0,0,,,0,0,,,,,
59,2,,,,2,1,0,0,0,0,0,25.04,26,160,260,,,3,4,,,2,1,,,78.41,44.54,,,3,2,,,,,,,,,,,
61,1,,,,2,0,0,1,0,0,0,35.8,40,30,,,,,,,,,,,,61.56,,,,4,,,,,,,,,,,,
81,1,,,,2,1,0,1,0,1,0,19.65,54,190,,,,4,,,,2,,,,31.41,,,,2,,,,,,,,,,,,
79,1,,,,1,1,0,0,0,0,0,23.2,55,80,,,,7,,,,7,,,,70.91,,,,4,,,,,,,(Group 2) ,,,,,
77,1,,,,1,1,0,0,0,0,0,18.9,30,280,,,,2,,,,6,,,,66.03,,,,4,,,,,,,,,,,,
56,1,,,,2,1,0,0,0,0,0,22.1,54,140,,,,11,,,,7,,,,64.14,,,,3,,,,,,,,,,,,
85,1,,,,1,1,0,0,0,0,0,16.6,44,60,,,,12,,,,9,,,,80.29,,,,4,,,,,,,,,,,,
81,1,,,,2,1,0,0,0,0,0,29.6,32,30,,,,2,,,,11,,,,61.01,,,,3,,,,,,,,,,,,
63,1,,,,1,1,0,0,0,0,0,20.1,46,120,,,,6,,,,6,,,,72.17,,,,4,,,,,,,,,,,,
50,1,,,,1,0,0,0,0,0,0,24.1,78,60,,,,12,,,,6,,,,76.89,,,,3,,,,,,,,,,,,
82,1,,,,1,0,0,0,0,0,0,27,50,0,,,,4,,,,3,,,,70.38,,,,4,,,,,,,,,,,,
