Participant,ID,AG_Date,Completed,Gender,Group,Weight,Height,Race,Ethnicity,Age,BMI,Assmnt,Avg_Daily_Week_Min,Avg_Daily_M_F_Min,Avg_Daily_Sa_Su_Min,Avg_Daily_Sed_Week_Min,Avg_Daily_Sed_M_F_Min,Avg_Daily_Sed_Sa_Su_Min,Avg_Daily_Light_Week_Min,Avg_Daily_Light_M_F_Min,Avg_Daily_Light_Sa_Su_Min,Avg_Daily_Mod_Week_Min,Avg_Daily_Mod_M_F_Min,Avg_Daily_Mod_Sa_Su_Min,Avg_Daily_Vig_Week_Min,Avg_Daily_Vig_M_F_Min,Avg_Daily_Vig_Sa_Su_Min,Avg_Daily_Very_Vig_Week_Min,Avg_Daily_Very_Vig_M_F_Min,Avg_Daily_Very_Vig_Sa_Su_Min
407-0001,1,11-Dec-17,Y,M,control,,,White,Not Hispanic or Latino,32,,baseline,910,977,742,629,695,464.5,256,252,264.5,22,26,13,3,4,0,0,0,0
407-0001,1,14-Dec-17,Y,M,control,129.4,196,White,Not Hispanic or Latino,32,33.7,,,,,,,,,,,,,,,,,,,
407-0001,1,5-Mar-18,Y,M,control,,,White,Not Hispanic or Latino,33,,endpstTr,824,876,694.5,521,581,372,252,243,275.5,47,47,47,4,5,0,0,0,0
407-0001,1,9-Apr-18,Y,M,control,,,White,Not Hispanic or Latino,33,,pstWash,848,868,797,579,611,499,229,219,252.5,40,38,45.5,0,0,0,0,0,0
407-0002,2,4-Dec-17,Y,M,control,,,White,Not Hispanic or Latino,33,,baseline,680,802,373.5,546,649,287.5,127,145,79.5,8,8,6.5,0,0,0,0,0,0
407-0002,2,8-Dec-17,Y,M,control,109.1,184.2,White,Not Hispanic or Latino,33,32.2,,,,,,,,,,,,,,,,,,,
407-0002,2,5-Mar-18,Y,M,control,,,White,Not Hispanic or Latino,33,,endpstTr,622,683,469.5,510,556,393,102,116,67,11,11,9.5,0,0,0,0,0,0
407-0002,2,9-Apr-18,Y,M,control,,,White,Not Hispanic or Latino,33,,pstWash,641,645,619,519,514,546,117,126,68,5,5,5,0,0,0,0,0,0
407-0003,3,20-Dec-17,Y,F,control,76.6,174.2,White,Not Hispanic or Latino,39,25.2,,,,,,,,,,,,,,,,,,,
407-0003,3,26-Dec-17,Y,F,control,,,White,Not Hispanic or Latino,39,,baseline,778,778,776,512,505,527.5,259,267,239,7,6,9.5,0,0,0,0,0,0
407-0003,3,25-Jun-18,Y,F,control,,,White,Not Hispanic or Latino,39,,pstWash,753,788,664,434,502,263.5,300,271,373.5,18,15,27,0,0,0,0,0,0
407-0004,4,8-Feb-18,,M,Experimental,89,181.6,White,Not Hispanic or Latino,20,27,,,,,,,,,,,,,,,,,,,
407-0004,4,27-Aug-18,,M,Experimental,,,White,Not Hispanic or Latino,21,,baseline,835,759,987,579,522,694,198,181,230.5,49,42,61,9,13,1.5,0,0,0
407-0004,4,26-Nov-18,,M,Experimental,,,White,Not Hispanic or Latino,21,,endpstTr,1078,1064,1113,857,838,906.5,187,186,190.5,32,38,16,2,2,0,0,0,0
407-0004,4,4-Feb-19,,M,Experimental,,,White,Not Hispanic or Latino,21,,pstWash,1039,1014,1101,798,794,806.5,224,203,274.5,17,16,20,0,1,0,0,0,0
407-0006,6,12-Mar-18,Y,F,control,,,White,Not Hispanic or Latino,23,,baseline,835,835,.,540,540,.,267,267,.,22,22,.,7,7,.,0,0,.
407-0006,6,14-Mar-18,Y,F,control,98,169.8,White,Not Hispanic or Latino,23,34,,,,,,,,,,,,,,,,,,,
407-0006,6,28-May-18,Y,F,control,,,White,Not Hispanic or Latino,23,,endpstTr,751,772,698,410,474,249,321,277,431,18,18,18,2,3,0,0,0,0
407-0006,6,2-Jul-18,Y,F,control,,,White,Not Hispanic or Latino,23,,pstWash,706,764,560,418,499,216,274,251,333,13,14,11,0,0,0,0,0,0
407-0007,7,1-Mar-18,Y,M,control,94,181.1,White,Not Hispanic or Latino,24,28.7,,,,,,,,,,,,,,,,,,,
407-0007,7,5-Mar-18,Y,M,control,,,White,Not Hispanic or Latino,24,,baseline,777,831,641.5,570,624,436,182,190,163,24,17,42.5,0,0,0,0,0,0
407-0007,7,4-Jun-18,Y,M,control,,,White,Not Hispanic or Latino,25,,endpstTr,869,864,880,600,627,533,239,211,307,30,26,40,0,0,0,0,0,0
407-0007,7,23-Jul-18,Y,M,control,,,White,Not Hispanic or Latino,25,,pstWash,627,807,176.5,465,585,164.5,146,199,12,16,23,0,0,0,0,0,0,0
407-0008,8,12-Mar-18,Y,F,control,,,White,Not Hispanic or Latino,26,,baseline,738,783,625.5,482,530,362,245,245,246,11,8,17.5,0,0,0,0,0,0
407-0008,8,16-Mar-18,Y,F,control,86.3,163.2,White,Not Hispanic or Latino,26,32.4,,,,,,,,,,,,,,,,,,,
407-0008,8,28-May-18,Y,F,control,,,White,Not Hispanic or Latino,26,,endpstTr,589,583,602.5,360,339,412.5,221,235,185.5,7,8,4.5,0,0,0,0,0,0
407-0008,8,17-Jul-18,Y,F,control,,,White,Not Hispanic or Latino,26,,pstWash,470,591,169,294,367,112.5,170,215,56.5,6,8,0,0,0,0,0,0,0
407-0010,10,,Y,M,Experimental,82.6,178.2,White,Not Hispanic or Latino,,26,,,,,,,,,,,,,,,,,,,
407-0010,10,26-Mar-18,Y,M,Experimental,,,White,Not Hispanic or Latino,30,,baseline,786,772,822,499,477,553,268,273,255,20,22,14,0,0,0,0,0,0
407-0010,10,18-Jun-18,Y,M,Experimental,,,White,Not Hispanic or Latino,30,,endpstTr,764,714,888.5,533,551,486,207,144,362,25,18,40.5,0,0,0,0,0,0
407-0010,10,30-Jul-18,Y,M,Experimental,,,White,Not Hispanic or Latino,30,,pstWash,651,652,650.5,484,511,416.5,156,129,224.5,11,12,9.5,0,0,0,0,0,0
407-0011,11,,,F,Experimental,76.5,166.1,White,Not Hispanic or Latino,,27.7,,,,,,,,,,,,,,,,,,,
407-0011,11,26-Mar-18,,F,Experimental,,,White,Not Hispanic or Latino,29,,baseline,726,743,685,445,453,426.5,259,263,249,22,27,9.5,0,0,0,0,0,0
407-0011,11,9-Jul-18,,F,Experimental,,,White,Not Hispanic or Latino,29,,endpstTr,654,675,601,378,382,365.5,251,261,225,22,26,10.5,4,5,0,0,0,0
407-0011,11,20-Aug-18,,F,Experimental,,,White,Not Hispanic or Latino,29,,pstWash,778,743,864,394,363,471,332,329,340,47,51,38.5,5,1,14.5,0,0,0
407-0012,12,28-Mar-18,,F,Experimental,63.2,152.6,White,Not Hispanic or Latino,28,27.1,,,,,,,,,,,,,,,,,,,
407-0012,12,2-Apr-18,,F,Experimental,,,White,Not Hispanic or Latino,28,,baseline,821,815,836,555,580,492.5,255,221,338.5,11,14,5,0,0,0,0,0,0
407-0012,12,21-Aug-18,,F,Experimental,,,White,Not Hispanic or Latino,28,,endpstTr,618,718,366.5,464,513,339,132,174,27.5,22,30,0,0,0,0,0,0,0
407-0012,12,15-Oct-18,,F,Experimental,,,White,Not Hispanic or Latino,28,,pstWash,921,935,884,607,609,602,290,294,280,24,33,2,0,0,0,0,0,0
407-0014,14,27-Apr-18,N,F,Experimental,113.4,178,White,Not Hispanic or Latino,31,35.8,,,,,,,,,,,,,,,,,,,
407-0014,14,30-Apr-18,N,F,Experimental,,,White,Not Hispanic or Latino,31,,baseline,732,784,603,521,585,362,154,155,149.5,52,41,80,5,3,11.5,0,0,0
407-0015,15,23-Apr-18,,M,Experimental,,,White,Not Hispanic or Latino,32,,baseline,812,839,745,561,586,497.5,205,211,189,45,39,58.5,2,2,0,0,0,0
407-0015,15,24-Apr-18,,M,Experimental,120.5,183,White,Not Hispanic or Latino,32,36,,,,,,,,,,,,,,,,,,,
407-0015,15,16-Jul-18,,M,Experimental,,,White,Not Hispanic or Latino,32,,endpstTr,794,791,802,574,614,473.5,184,154,260,36,23,68.5,0,0,0,0,0,0
407-0015,15,27-Aug-18,,M,Experimental,,,White,Not Hispanic or Latino,33,,pstWash,766,750,805,530,498,608,190,208,145.5,46,43,51.5,0,0,0,0,0,0
407-0016,16,23-Apr-18,,F,Experimental,,,White,Not Hispanic or Latino,24,,baseline,647,684,556,455,485,379.5,175,181,162.5,17,19,14,0,0,0,0,0,0
407-0016,16,24-Apr-18,,F,Experimental,67.5,165.6,White,Not Hispanic or Latino,24,24.6,,,,,,,,,,,,,,,,,,,
407-0016,16,23-Jul-18,,F,Experimental,,,White,Not Hispanic or Latino,25,,endpstTr,722,713,745.5,493,483,519,216,221,204.5,13,9,22,0,0,0,0,0,0
407-0016,16,27-Aug-18,,F,Experimental,,,White,Not Hispanic or Latino,25,,pstWash,518,491,586,383,360,440,125,118,143,10,12,3,0,0,0,0,0,0
407-0017,17,27-Apr-18,,F,Experimental,108.4,180.1,White,Not Hispanic or Latino,21,33.4,,,,,,,,,,,,,,,,,,,
407-0017,17,30-Apr-18,,F,Experimental,,,White,Not Hispanic or Latino,21,,baseline,822,871,724,591,638,498,210,209,211,25,24,14,0,0,1,0,0,0
407-0017,17,20-Aug-18,,F,Experimental,,,White,Not Hispanic or Latino,22,,pstWash,655,697,550.5,458,463,446,173,206,89.5,25,29,15,0,0,0,0,0,0
407-0018,18,27-Apr-18,,M,control,114.8,191.4,White,Not Hispanic or Latino,33,31.3,,,,,,,,,,,,,,,,,,,
407-0018,18,30-Apr-18,,M,control,,,White,Not Hispanic or Latino,33,,baseline,796,837,692,479,523,371,272,265,288,45,50,33,0,0,0,0,0,0
407-0018,18,30-Jul-18,,M,control,,,White,Not Hispanic or Latino,33,,endpstTr,868,887,822,535,552,491.5,289,289,288.5,45,46,42,0,0,0,0,0,0
407-0018,18,10-Sep-18,,M,control,,,White,Not Hispanic or Latino,33,,pstWash,927,928,926,560,555,574,313,319,297,54,54,55,0,0,0,0,0,0
407-0019,19,7-May-18,,F,control,,,White,Not Hispanic or Latino,35,,baseline,792,798,775.5,343,370,275.5,377,373,387,71,55,111.5,1,0,1.5,0,0,0
407-0019,19,9-May-18,,F,control,90.1,163.6,White,Not Hispanic or Latino,35,33.7,,,,,,,,,,,,,,,,,,,
407-0019,19,13-Aug-18,,F,control,,,White,Not Hispanic or Latino,36,,endpstTr,740,703,831.5,367,340,435,333,321,361.5,37,38,35,3,4,0,0,0,0
407-0019,19,24-Sep-18,,F,control,,,White,Not Hispanic or Latino,36,,pstWash,870,912,765,380,393,349,426,449,369.5,60,65,46.5,3,4,0,0,0,0
407-0020,20,17-May-18,,F,Experimental,74.2,161.4,Asian,Not Hispanic or Latino,24,28.5,,,,,,,,,,,,,,,,,,,
407-0020,20,21-May-18,,F,Experimental,,,Asian,Not Hispanic or Latino,24,,baseline,745,741,754.5,485,465,534.5,226,230,214,34,45,6,0,1,0,0,0,0
407-0020,20,30-Jul-18,,F,Experimental,,,Asian,Not Hispanic or Latino,24,,endpstTr,673,615,760.5,422,353,526.5,244,254,230,7,8,4,0,0,0,0,0,0
407-0020,20,10-Sep-18,,F,Experimental,,,Asian,Not Hispanic or Latino,25,,pstWash,689,726,596.5,441,448,425,242,271,169,6,8,2.5,0,0,0,0,0,0
407-0021,21,17-May-18,,M,Experimental,99,194.8,White,Not Hispanic or Latino,30,26.1,,,,,,,,,,,,,,,,,,,
407-0021,21,21-May-18,,M,Experimental,,,White,Not Hispanic or Latino,30,,baseline,617,619,611.5,438,451,406,155,137,197.5,24,30,8,0,0,0,0,0,0
407-0021,21,20-Aug-18,,M,Experimental,,,White,Not Hispanic or Latino,30,,endpstTr,502,542,401.5,345,369,285,124,133,100.5,28,34,15,4,5,1,1,1,0
407-0021,21,1-Oct-18,,M,Experimental,,,White,Not Hispanic or Latino,30,,pstWash,710,696,743.5,525,523,529.5,164,152,194.5,18,21,9.5,1,0,2,2,0,8
407-0022,22,21-May-18,,M,control,,,White,Not Hispanic or Latino,30,,baseline,816,759,958.5,635,596,731,164,148,202.5,18,15,25,0,0,0,0,0,0
407-0022,22,22-May-18,,M,control,91.3,178.1,White,Not Hispanic or Latino,30,28.8,,,,,,,,,,,,,,,,,,,
407-0022,22,27-Aug-18,,M,control,,,White,Not Hispanic or Latino,30,,endpstTr,726,727,722.5,502,496,517.5,197,201,186.5,27,30,18,0,0,0.5,0,0,0
407-0022,22,22-Oct-18,,M,control,,,White,Not Hispanic or Latino,31,,pstWash,711,693,757.5,500,488,531,197,189,214.5,13,13,12,1,2,0,0,0,0
407-0023,23,28-May-18,N,F,control,,,White,Not Hispanic or Latino,27,,baseline,651,611,751,380,361,427.5,261,239,316,10,11,7.5,0,0,0,0,0,0
407-0023,23,30-May-18,N,F,control,70.2,164,White,Not Hispanic or Latino,27,26.1,,,,,,,,,,,,,,,,,,,
,24,,,M,,,,,,,,,,,,,,,,,,,,,,,,,,
407-0024,24,28-May-18,,,,,,,,,,baseline,787,826,691,547,609,392,225,199,288,16,18,11,0,0,0,0,0,0
407-0025,25,15-Jun-18,,M,Experimental,71.1,169.4,Asian,Not Hispanic or Latino,35,24.8,,,,,,,,,,,,,,,,,,,
407-0025,25,17-Dec-18,,M,Experimental,,,Asian,Not Hispanic or Latino,35,,endpstTr,603,629,540,347,379,268,217,208,238.5,39,41,33.5,0,0,0,0,0,0
407-0025,25,4-Mar-19,,M,Experimental,,,Asian,Not Hispanic or Latino,36,,pstWash,383,365,430,193,202,169.5,166,131,253.5,25,32,7,0,0,0,0,0,0
407-0026,26,7-Jun-18,,M,Experimental,95.8,189.8,White,Not Hispanic or Latino,31,26.6,,,,,,,,,,,,,,,,,,,
407-0026,26,11-Jun-18,,M,Experimental,,,White,Not Hispanic or Latino,31,,baseline,654,675,601.5,514,509,529,138,164,72,2,2,0.5,0,0,0,0,0,0
407-0026,26,27-Aug-18,,M,Experimental,,,White,Not Hispanic or Latino,31,,endpstTr,589,627,493.5,345,318,410.5,242,306,83,1,2,0,0,0,0,0,0,0
407-0026,26,8-Oct-18,,M,Experimental,,,White,Not Hispanic or Latino,32,,pstWash,575,678,317.5,287,303,246,285,372,68,3,3,3.5,0,0,0,0,0,0
407-0027,27,4-Jun-18,N,F,control,,,Asian,Not Hispanic or Latino,23,,baseline,1235,1264,1162,708,735,643,517,522,506,9,7,13,0,0,0,0,0,0
407-0027,27,6-Jun-18,N,F,control,93.2,164.3,Asian,Not Hispanic or Latino,23,34.5,,,,,,,,,,,,,,,,,,,
407-0028,28,7-Jun-18,N,F,Experimental,91.3,166.8,American Indian or Alaskan Native,Not Hispanic or Latino,33,32.8,,,,,,,,,,,,,,,,,,,
407-0028,28,11-Jun-18,N,F,Experimental,,,American Indian or Alaskan Native,Not Hispanic or Latino,34,,baseline,742,809,404,457,486,311,264,300,84,21,23,9,0,0,0,0,0,0
407-0029,29,18-Jun-18,,M,control,88.7,181.7,White,Not Hispanic or Latino,19,26.9,baseline,882,857,945,637,586,763.5,228,249,173.5,17,21,8,0,0,0,0,0,0
407-0029,29,24-Sep-18,,M,control,,,White,Not Hispanic or Latino,20,,endpstTr,487,488,485,353,351,358.5,108,105,115.5,25,31,10.5,0,0,0.5,0,0,0
407-0029,29,5-Nov-18,,M,control,,,White,Not Hispanic or Latino,20,,pstWash,478,514,390,345,372,279,107,108,106,25,33,5,1,1,0,0,0,0
407-0030,30,18-Jun-18,,F,Experimental,79.9,172.6,White,,20,26.8,baseline,646,667,594,376,378,370,247,259,217,23,29,7,0,0,0,0,0,0
407-0030,30,17-Sep-18,,F,Experimental,,,White,,20,,endpstTr,186,167,282,170,162,210,16,5,67,1,0,5,0,0,0,0,0,0
407-0030,30,29-Oct-18,,F,Experimental,,,White,,20,,pstWash,534,539,520,340,343,333.5,183,183,181.5,11,14,5,0,0,0,0,0,0
407-0031,31,25-Jun-18,N,M,control,,,White,Not Hispanic or Latino,25,,baseline,765,730,850,326,351,263,407,348,553.5,31,30,32,1,0,1.5,0,0,0
407-0031,31,26-Jun-18,N,M,control,111.2,184.7,White,Not Hispanic or Latino,25,32.6,,,,,,,,,,,,,,,,,,,
407-0032,32,25-Jun-18,N,M,,,,White,Not Hispanic or Latino,39,,baseline,1225,1220,1237,751,755,740,454,446,475.5,20,20,21.5,0,0,0,0,0,0
407-0032,32,26-Jun-18,N,M,,113.9,178.8,White,Not Hispanic or Latino,39,35.6,,,,,,,,,,,,,,,,,,,
407-0033,33,18-Jun-18,N,M,control,106,180.4,Black or African American,Not Hispanic or Latino,19,32.6,baseline,753,715,943,462,434,603,281,271,330,10,10,10,0,0,0,0,0,0
407-0036,36,19-Jul-18,,F,,80.4,169.1,White,,19,28.1,,,,,,,,,,,,,,,,,,,
407-0037,37,2-Jul-18,,F,control,,,Multi-Racial,Hispanic or Latino,32,,baseline,680,690,653,382,377,394.5,288,305,246,10,8,12.5,0,0,0,0,0,0
407-0037,37,6-Jul-18,,F,control,99.1,166,Multi-Racial,Hispanic or Latino,32,36,,,,,,,,,,,,,,,,,,,
407-0037,37,15-Oct-18,,F,control,,,Multi-Racial,Hispanic or Latino,32,,endpstTr,590,591,587,336,315,388,245,267,192,9,9,7,0,0,0,0,0,0
407-0037,37,26-Nov-18,,F,control,,,Multi-Racial,Hispanic or Latino,32,,pstWash,567,575,545.5,322,287,407.5,237,278,135.5,8,10,2.5,0,0,0,0,0,0
407-0038,38,2-Jul-18,,M,Experimental,,,White,Not Hispanic or Latino,35,,baseline,814,850,722.5,530,538,510.5,271,302,195,13,11,17,0,0,0,0,0,0
407-0038,38,26-Jul-18,,M,Experimental,95.3,181.5,White,Not Hispanic or Latino,35,28.9,,,,,,,,,,,,,,,,,,,
407-0038,38,8-Oct-18,,M,Experimental,,,White,Not Hispanic or Latino,35,,endpstTr,510,42,410.5,326,346,287,176,203,121,10,12,2.5,0,0,0,0,0,0
407-0038,38,19-Nov-18,,M,Experimental,,,White,Not Hispanic or Latino,35,,pstWash,491,569,296.5,329,369,228.5,155,191,65.5,7,9,2.5,0,0,0,0,0,0
407-0041,41,2-Jul-18,N,F,,,,White,Not Hispanic or Latino,25,,baseline,551,647,310,379,445,213,168,197,95.5,4,5,1.5,0,0,0,0,0,0
407-0041,41,17-Jul-18,N,F,,102.4,174.3,White,Not Hispanic or Latino,25,33.7,,,,,,,,,,,,,,,,,,,
407-0042,42,2-Jul-18,,F,control,,,White,Not Hispanic or Latino,35,,baseline,783,788,760,505,530,377,228,223,255,37,34,52,14,2,76,0,0,0
407-0042,42,6-Jul-18,,F,control,90.1,175.4,White,Not Hispanic or Latino,35,29.3,,,,,,,,,,,,,,,,,,,
407-0042,42,15-Oct-18,,F,control,,,White,Not Hispanic or Latino,35,,endpstTr,768,870,512.5,527,604,333,184,188,174,55,75,5.5,1,2,0,0,0,0
407-0042,42,3-Dec-18,,F,control,,,White,Not Hispanic or Latino,35,,pstWash,789,813,728,473,514,370,280,256,339,34,41,18.5,2,3,0.5,0,0,0
407-0043,43,23-Jul-18,N,F,Experimental,,,White,,18,,baseline,314,426,32.5,151,203,23,145,199,9.5,18,25,0,0,0,0,0,0,0
407-0043,43,24-Jul-18,N,F,Experimental,83.6,166.5,White,,18,30.2,,,,,,,,,,,,,,,,,,,
407-0044,44,16-Jul-18,,M,Experimental,,,White,Not Hispanic or Latino,29,,baseline,1257,1268,1230,873,928,735,364,321,474,20,19,21,0,0,0,0,0,0
407-0044,44,17-Jul-18,,M,Experimental,95.5,185.8,White,Not Hispanic or Latino,29,27.7,,,,,,,,,,,,,,,,,,,
407-0044,44,22-Oct-18,,M,Experimental,,,White,Not Hispanic or Latino,29,,endpstTr,787,855,616.3333333,602,672,426,152,155,142,33,28,47.91666667,0,0,0.416666667,0,0,0
407-0044,44,3-Dec-18,,M,Experimental,,,White,Not Hispanic or Latino,29,,pstWash,853,938,641,568,645,376,275,282,258,10,11,7,0,0,0,0,0,0
407-0045,45,13-Aug-18,,F,Experimental,70.7,164.3,White,Hispanic or Latino,23,26.2,baseline,726,846,128,422,487,98,286,338,29,17,21,1,0,0,0,0,0,0
407-0045,45,14-Jan-19,,F,Experimental,,,White,Hispanic or Latino,23,,endpstTr,882,861,934.5,607,607,605.5,236,215,290.5,34,33,36.5,5,6,2,0,0,0
407-0045,45,4-Mar-19,,F,Experimental,,,White,Hispanic or Latino,24,,pstWash,741,832,514,492,538,376,209,240,131,37,49,6.5,4,5,0.5,0,0,0
407-0046,46,13-Aug-18,,M,Experimental,101,182.2,White,,26,30.4,,,,,,,,,,,,,,,,,,,
407-0046,46,20-Aug-18,,M,Experimental,,,White,,26,,baseline,887,897,864,549,567,503,301,286,338,27,30,20,8,10,3,2,3,0
407-0046,46,17-Dec-18,,M,Experimental,,,White,,26,,endpstTr,844,848,833.5,484,471,516,354,371,310.5,6,6,7,0,0,0,0,0,0
407-0046,46,28-Jan-19,,M,Experimental,,,White,,26,,pstWash,746,737,767.4166667,545,541,553.8333333,178,175,184,23,21,28.58333333,0,0,0.916666667,0,0,8.33E-02
407-0047,47,14-Sep-18,,F,control,71.3,162,White,Not Hispanic or Latino,30,27.2,,,,,,,,,,,,,,,,,,,
407-0047,47,17-Sep-18,,F,control,,,White,Not Hispanic or Latino,30,,baseline,785,801,745,432,493,280,309,261,427.5,45,47,37.5,0,0,0,0,0,0
407-0047,47,10-Dec-18,,F,control,,,White,Not Hispanic or Latino,31,,endpstTr,975,929,1090.5,635,633,640.5,309,259,432.5,29,33,17.5,3,4,0,0,0,0
407-0047,47,21-Jan-19,,F,control,,,White,Not Hispanic or Latino,31,,pstWash,827,824,834,514,547,431,294,259,382,18,17,21,0,0,0,0,0,0
407-0048,48,14-Sep-18,,F,control,66.7,152,Asian,Not Hispanic or Latino,32,28.9,,,,,,,,,,,,,,,,,,,
407-0048,48,17-Sep-18,,F,control,,,Asian,Not Hispanic or Latino,32,,baseline,749,765,707,504,541,410,226,202,284.5,19,22,12.5,0,0,0,0,0,0
407-0048,48,31-Dec-18,,F,control,,,Asian,Not Hispanic or Latino,32,,endpstTr,791,840,546,488,551,176,295,285,344,8,4,26,0,0,0,0,0,0
407-0048,48,25-Feb-19,,F,control,,,Asian,Not Hispanic or Latino,33,,pstWash,799,812,766.5,513,534,458.5,278,270,299,8,8,9,0,0,0,0,0,0
,49,,,F,,,,,,,,,,,,,,,,,,,,,,,,,,
407-0049,49,17-Sep-18,,,,,,,,,,baseline,731,725,745.5,427,436,407,277,265,305.5,27,24,33,0,0,0,0,0,0
407-0050,50,14-Sep-18,N,F,,108.5,176,White,Not Hispanic or Latino,23,35,,,,,,,,,,,,,,,,,,,
407-0051,51,19-Sep-18,,M,control,89.1,185.4,White,,32,25.9,,,,,,,,,,,,,,,,,,,
407-0051,51,1-Oct-18,,M,control,,,White,,32,,baseline,658,644,691,443,441,446.5,191,173,237,24,30,7.5,0,0,0,0,0,0
407-0051,51,3-Dec-18,,M,control,,,White,,32,,endpstTr,706,48,820,498,453,587,189,176,215,24,21,18,0,0,0,0,0,0
407-0051,51,14-Jan-19,,M,control,,,White,,32,,pstWash,808,766,913.5,590,557,672.5,199,184,235.5,19,24,5.5,0,0,0,0,0,0
407-0052,52,19-Sep-18,,M,control,91.7,174.1,White,Not Hispanic or Latino,30,30.3,,,,,,,,,,,,,,,,,,,
407-0052,52,24-Sep-18,,M,control,,,White,Not Hispanic or Latino,30,,baseline,742,850,473,528,619,301,188,197,168,25,34,4,0,0,0,0,0,0
407-0052,52,7-Jan-19,,M,control,,,White,Not Hispanic or Latino,30,,endpstTr,670,707,576,366,403,271,294,292,301,10,12,3.5,0,0,0.5,0,0,0
407-0052,52,25-Feb-19,,M,control,,,White,Not Hispanic or Latino,30,,pstWash,776,759,819,546,550,538,193,165,262.5,36,44,18.5,0,0,0,0,0,0
407-0053,53,1-Oct-18,,F,Experimental,,,White,Not Hispanic or Latino,31,,baseline,713,778,551,355,364,333,339,389,213,19,24,5,0,0,0,0,0,0
407-0053,53,2-Oct-18,,F,Experimental,77.6,168.5,White,Not Hispanic or Latino,31,27.3,,,,,,,,,,,,,,,,,,,
407-0053,53,24-Dec-18,,F,Experimental,,,White,Not Hispanic or Latino,31,,endpstTr,882,909,828,460,451,477.5,415,449,349,8,10,1.5,0,0,0,0,0,0
407-0053,53,11-Mar-19,,F,Experimental,,,White,Not Hispanic or Latino,31,,pstWash,797,774,852.5,444,373,622.5,342,389,225,10,12,5,0,0,0,0,0,0
,54,,N,,,,,,,,,,,,,,,,,,,,,,,,,,,
407-0054,54,8-Oct-18,N,F,,,,Multi-Racial,Not Hispanic or Latino,35,,baseline,784,796,754.5,474,459,509.5,307,332,244.5,4,5,0.5,0,0,0,0,0,0
407-0054,54,10-Oct-18,N,F,,97.1,171.6,Multi-Racial,Not Hispanic or Latino,35,33,,,,,,,,,,,,,,,,,,,
407-0055,55,10-Oct-18,,F,control,83.6,169.6,White,Not Hispanic or Latino,19,29.1,,,,,,,,,,,,,,,,,,,
407-0055,55,15-Oct-18,,F,control,,,White,Not Hispanic or Latino,19,,baseline,514,616,259,366,432,200.5,125,156,46.5,23,28,12,0,0,0,0,0,0
407-0055,55,28-Jan-19,,F,control,,,White,Not Hispanic or Latino,19,,pstWash,582,694,413,374,451,259.5,180,208,138.5,26,33,15,1,2,0,0,1,0
407-0056,56,15-Oct-18,,F,control,,,White,Not Hispanic or Latino,28,,baseline,766,793,700,473,485,442,281,298,239.5,12,9,18.5,0,0,0,0,0,0
407-0056,56,31-Oct-18,,F,control,81.6,175.7,White,Not Hispanic or Latino,28,26.4,,,,,,,,,,,,,,,,,,,
407-0056,56,11-Feb-19,,F,control,,,White,Not Hispanic or Latino,28,,endpstTr,711,636,898.5,363,332,440,339,296,447.5,9,8,11,0,0,0,0,0,0
407-0056,56,18-Mar-19,,F,control,,,White,Not Hispanic or Latino,28,,pstWash,749,690,1042,470,405,794,260,263,242,17,20,6,2,2,0,0,0,0
407-0057,57,2-Oct-18,,F,Experimental,70.3,166.4,White,Not Hispanic or Latino,20,25.4,,,,,,,,,,,,,,,,,,,
407-0057,57,8-Oct-18,,F,Experimental,,,White,Not Hispanic or Latino,20,,baseline,634,631,640,423,416,440,191,194,183.5,20,22,16.5,0,0,0,0,0,0
407-0057,57,14-Jan-19,,F,Experimental,,,White,Not Hispanic or Latino,20,,endpstTr,337,404,172,251,296,137.5,66,80,31.5,21,28,3,0,0,0,0,0,0
407-0058,58,2-Oct-18,,F,Experimental,66.1,160.5,White,Not Hispanic or Latino,22,25.7,,,,,,,,,,,,,,,,,,,
407-0058,58,8-Oct-18,,F,Experimental,,,White,Not Hispanic or Latino,22,,baseline,1440,1440,1440,1136,1163,1068.5,281,252,351,23,24,20.5,0,0,0,0,0,0
407-0058,58,4-Mar-19,,F,Experimental,,,White,Not Hispanic or Latino,22,,pstWash,1440,1440,1440,1298,1289,1319,116,122,101,25,27,20,1,1,0,0,0,0
407-0059,59,18-Feb-18,,F,Experimental,,,White,Not Hispanic or Latino,20,,pstWash,439,436,452,309,318,275,99,88,147,28,30,21,3,1,9,0,0,0
407-0059,59,8-Oct-18,,F,Experimental,,,White,Not Hispanic or Latino,20,,baseline,645,662,602.5,469,482,438.5,158,162,146,18,18,18,0,0,0,0,0,0
407-0059,59,10-Oct-18,,F,Experimental,87.9,170.8,White,Not Hispanic or Latino,20,30.1,,,,,,,,,,,,,,,,,,,
407-0059,59,31-Dec-18,,F,Experimental,,,White,Not Hispanic or Latino,20,,endpstTr,683,706,570,505,519,435,164,171,126,13,14,9,1,1,0,0,0,0
407-0060,60,8-Nov-18,,M,Experimental,90,176.4,White,Not Hispanic or Latino,24,28.9,,,,,,,,,,,,,,,,,,,
407-0060,60,12-Nov-18,,M,Experimental,,,White,Not Hispanic or Latino,24,,baseline,900,957,755.5,690,736,574,184,190,168.5,26,31,13,0,0,0,0,0,0
407-0060,60,18-Mar-19,,M,Experimental,,,White,Not Hispanic or Latino,24,,endpstTr,885,1015,562.5,730,845,441.5,139,155,100,11,11,11.5,4,1,9,2,2,0.5
407-0060,60,6-May-19,,M,Experimental,,,White,Not Hispanic or Latino,24,,pstWash,1005,1029,944.5,791,804,758.5,187,196,166,26,29,19.5,0,0,0.5,0,0,0
,61,,,,,,,,,,,,,,,,,,,,,,,,,,,,,
407-0062,62,19-Nov-18,,M,Experimental,,,White,,25,,baseline,754,756,750,423,387,512.5,325,363,231,6,6,6.5,0,0,0,0,0,0
407-0062,62,23-Nov-18,,M,Experimental,96.8,181.1,White,,25,29.5,,,,,,,,,,,,,,,,,,,
407-0062,62,1-Apr-19,,M,Experimental,,,White,,25,,pstWash,698,703,686,365,401,276,318,288,391.5,15,14,18.5,0,0,0,0,0,0
,63,,,,,,,,,,,,,,,,,,,,,,,,,,,,,
407-0063,63,26-Nov-18,,,,,,,,,,baseline,817,780,908,492,475,536,305,284,357,19,21,15,0,0,0,0,0,0
407-0064,64,23-Nov-18,N,M,,93.8,187.2,White,Not Hispanic or Latino,28,26.8,,,,,,,,,,,,,,,,,,,
407-0064,64,26-Nov-18,N,M,,,,White,Not Hispanic or Latino,28,,baseline,748,758,724,567,597,492,174,156,221,7,5,11,0,0,0,0,0,0
,65,,,,,,,,,,,,,,,,,,,,,,,,,,,,,
407-0066,66,6-Dec-18,N,M,,98.5,197.5,White,Not Hispanic or Latino,27,25.3,,,,,,,,,,,,,,,,,,,
407-0067,67,10-Dec-18,,M,Experimental,,,Multi-Racial,Not Hispanic or Latino,27,,baseline,821,816,831.5,619,618,621.5,176,167,199,24,30,11,1,2,0,0,0,0
407-0067,67,13-Dec-18,,M,Experimental,86.3,172.1,Multi-Racial,Not Hispanic or Latino,27,29.1,,,,,,,,,,,,,,,,,,,
407-0067,67,9-Apr-19,,M,Experimental,,,Multi-Racial,Not Hispanic or Latino,27,,endpstTr,427,577,52,337,453,48,71,99,3.5,18,25,0.5,0,0,0,0,0,0
407-0067,67,13-May-19,,M,Experimental,,,Multi-Racial,Not Hispanic or Latino,27,,pstWash,603,590,636.5,381,374,398,188,182,205,31,30,33.5,3,5,0,0,0,0
407-0068,68,6-Dec-18,N,F,,88.2,155,White,Not Hispanic or Latino,31,36.7,,,,,,,,,,,,,,,,,,,
407-0068,68,10-Dec-18,N,F,,,,White,Not Hispanic or Latino,31,,baseline,845,852,827.5,521,523,517.5,290,291,287.5,30,33,22.5,3,5,0,0,0,0