Participant,ID,RRV_Date,Completed,Gender,Group,Weight,Height,Race,Ethnicity,Age,BMI,Assmnt,time,RRV_Pgoal,RRV_PPmax,RRVPpmaxch,RRV_Presp,RRV_Prespch,RRV_Agoal,RRV_APmax,RRVApmaxch,RRV_Aresp,RRV_Arespch,RRVscore,RRVch,setsPos,setsNeg,oesPos,oesNeg,pretieqPref,pretieqPrefch,pretieqTole,pretieqTolech,DiscTolS,DiscTolSch,ssesFam,ssesFri,ExSES,ecsSTIt,ecsMkTm,pnsesAuto,pnsesRela,pnsesComp,breq3Intri,breq3Intrich,breq3Exter,breq3Exterch,breq3Integ,breq3Integch,breq3Ident,breq3Identch,breq3Intro,breq3Introch,breq3Amoti
407-0001,1,14-Dec-17,Y,M,,129.4,196,White,Not Hispanic or Latino,32,33.7,,,,,,,,,,,,,,,,,,,,,,,,,,,,,,,,,,,,,,,,,,,
407-0001,1,18-Dec-17,Y,M,control,124.7,196,White,Not Hispanic or Latino,32,32.5,baseline,1,ellip,2,,59,,read,2,,60,,0.5,,6,5,90,3.33,30,,24,,24,,17,29,100,35,19,25,30,36,12,,0,,14,,12,,4,,0
407-0001,1,20-Feb-18,Y,M,control,121.6,,White,Not Hispanic or Latino,33,31.7,endpstTr,6,tmill,4,2,296,237,read,0,-2,0,-60,1,0.5,,,91,13.33,32,2,23,-1,22,-2,21,38,100,34,17,30,33,35,16,4,0,0,13,-1,12,0,4,0,0
407-0001,1,28-Mar-18,Y,M,control,123.6,,White,Not Hispanic or Latino,33,32.2,postWash,10,tmill,3,1,135,76,read,1,-1,18,-42,0.75,0.25,,,,,30,0,39,15,17,-7,15,33,100,34,18,30,29,34,12,0,0,0,10,-4,12,0,4,0,0
407-0002,2,8-Dec-17,Y,M,,109.1,184.2,White,Not Hispanic or Latino,33,32.2,,,,,,,,,,,,,,,,,,,,,,,,,,,,,,,,,,,,,,,,,,,
407-0002,2,13-Dec-17,Y,M,control,108.9,184.2,White,Not Hispanic or Latino,33,32.1,baseline,1,cycle,0,,0,,wrdgms,4,,295,,0,,6,6,83,48.33,26,,20,,22,,0,29,78.75,34,15,25,29,28,8,,4,,4,,10,,6,,0
407-0002,2,20-Feb-18,Y,M,control,108.6,,White,Not Hispanic or Latino,33,32,endpstTr,6,ellip,0,0,0,0,cwrdpz,4,0,297,2,0,0,,,71,46.17,23,-3,19,-1,26,4,17,27,55,30,14,20,25,23,10,2,6,2,9,5,10,0,6,0,3
407-0002,2,29-Mar-18,Y,M,control,107.6,,White,Not Hispanic or Latino,33,31.7,postWash,10,cycle,0,0,0,0,wrdgms,3,-1,144,-151,0,0,,,,,22,-4,19,-1,25,3,13,16,93.75,24,16,21,14,24,9,1,2,-2,8,4,12,2,10,4,2
407-0003,3,20-Dec-17,Y,F,,76.6,174.2,White,Not Hispanic or Latino,39,25.2,,,,,,,,,,,,,,,,,,,,,,,,,,,,,,,,,,,,,,,,,,,
407-0003,3,8-Jan-18,Y,F,control,74.9,174.2,White,Not Hispanic or Latino,39,24.7,baseline,1,tmill,3,,132,,read,1,,23,,0.75,,5,0,89.5,40,19,,23,,18,,34,22,95,19,13,30,24,30,11,,5,,9,,14,,8,,0
407-0003,3,6-Apr-18,Y,F,control,73.4,,White,Not Hispanic or Latino,39,24.2,endpstTr,6,tmill,2,-1,91,-41,read,1,0,18,-5,0.666666667,-0.083333333,,,92.7,24.67,25,6,25,2,21,3,30,21,53.75,23,12,24,28,31,12,1,4,-1,12,3,14,0,5,-3,0
407-0003,3,29-May-18,Y,F,control,72.3,,White,Not Hispanic or Latino,39,23.8,postWash,10,tmill,3,0,143,11,read,1,0,18,-5,0.75,0,,,,,23,4,27,4,17,-1,37,23,33.75,26,11,30,32,33,12,1,2,-3,12,3,15,1,5,-3,0
407-0004,4,8-Feb-18,,M,,89,181.6,White,Not Hispanic or Latino,20,27,,,,,,,,,,,,,,,,,,,,,,,,,,,,,,,,,,,,,,,,,,,
407-0004,4,5-Sep-18,,M,Experimental,97.1,181.6,White,Not Hispanic or Latino,21,29.7,baseline,1,ellip,2,,61,,cwrdpz,3,,135,,0.4,,5,5,84,61.83,28,,22,,14,,19,13,100,40,19,30,16,31,7,,7,,6,,10,,4,,0
407-0004,4,7-Nov-18,,M,Experimental,104.6,,White,Not Hispanic or Latino,21,31.7,endpstTr,6,ellip,2,0,56,-5,cwrdpz,2,-1,61,-74,0.5,0.1,,,65.3,34.17,32,4,26,4,17,3,19,17,93.75,32,16,30,16,33,8,1,14,7,7,1,13,3,9,5,5
407-0004,4,16-Jan-19,,M,Experimental,109.3,,White,Not Hispanic or Latino,21,33.1,postWash,10,ellip,2,0,60,-1,wrdgms,2,-1,60,-75,0.5,0.1,,,,,32,4,26,4,20,6,19,20,72.5,37,16,30,26,27,8,1,15,8,8,2,14,4,12,8,2
407-0006,6,14-Mar-18,Y,F,,98,169.8,White,Not Hispanic or Latino,23,34,,,,,,,,,,,,,,,,,,,,,,,,,,,,,,,,,,,,,,,,,,,
407-0006,6,21-Mar-18,Y,F,control,99.6,169.8,White,Not Hispanic or Latino,23,34.5,baseline,1,ellip,5,,619,,cwrdpz,2,,59,,0.714285714,,5,3,80,35,26,,28,,21,,13,21,100,30,14,30,31,16,8,,1,,4,,12,,5,,0
407-0006,6,16-May-18,Y,F,control,96.1,,White,Not Hispanic or Latino,23,33.3,endpstTr,6,ellip,0,-5,0,-619,wrdgms,4,2,297,238,0,-0.714285714,,,73.5,8.33,25,-1,22,-6,24,3,13,26,83.75,33,20,30,36,27,8,0,0,-1,9,5,13,1,3,-2,1
407-0006,6,22-Jun-18,Y,F,control,98,,White,Not Hispanic or Latino,23,34,postWash,10,ellip,0,-5,0,-619,wrdgms,3,1,133,74,0,-0.714285714,,,,,30,4,24,-4,23,2,14,23,70,36,18,30,30,25,9,1,2,1,7,3,12,0,5,0,0
407-0007,7,1-Mar-18,Y,M,,94,181.1,White,Not Hispanic or Latino,24,28.7,,,,,,,,,,,,,,,,,,,,,,,,,,,,,,,,,,,,,,,,,,,
407-0007,7,13-Mar-18,Y,M,control,93.1,181.1,White,Not Hispanic or Latino,24,28.4,baseline,1,ellip,4,,287,,wrdgms,0,,0,,1,,6,1,67.8,21,14,,21,,19,,17,26,100,35,20,30,30,33,9,,3,,9,,13,,6,,0
407-0007,7,21-May-18,Y,M,control,95.8,,White,Not Hispanic or Latino,25,29.2,endpstTr,6,ellip,6,2,1252,965,read,0,0,0,0,1,0,,,70.2,34.83,15,1,27,6,22,3,19,27,80,20,13,30,31,32,11,2,6,3,9,0,14,1,9,3,0
407-0007,7,11-Jul-18,Y,M,control,97.2,,White,Not Hispanic or Latino,25,29.6,postWash,10,ellip,6,2,1249,962,read,0,0,0,0,1,0,,,,,18,4,24,3,20,1,18,29,100,31,20,30,32,34,10,1,6,3,12,3,16,3,12,6,0
407-0008,8,16-Mar-18,Y,F,,86.3,163.2,White,Not Hispanic or Latino,26,32.4,,,,,,,,,,,,,,,,,,,,,,,,,,,,,,,,,,,,,,,,,,,
407-0008,8,22-Mar-18,Y,F,control,99.3,163.2,White,Not Hispanic or Latino,26,37.3,baseline,1,tmill,5,,635,,cwrdpz,2,,55,,0.714285714,,5,5,81.9,5.83,25,,18,,19,,23,20,90,29,18,29,28,28,9,,3,,4,,9,,4,,0
407-0008,8,18-May-18,Y,F,control,88.6,,White,Not Hispanic or Latino,26,33.3,endpstTr,6,cycle,0,-5,0,-635,cwrdpz,5,3,598,543,0,-0.714285714,,,66.2,16,30,5,25,7,26,7,23,23,100,40,19,27,28,32,14,5,2,-1,4,0,12,3,5,1,0
407-0008,8,25-Jun-18,Y,F,control,87.5,,White,Not Hispanic or Latino,26,32.9,postWash,10,cycle,0,-5,0,-635,cwrdpz,4,2,299,244,0,-0.714285714,,,,,30,5,26,8,27,8,27,23,95,33,18,30,30,32,12,3,5,2,8,4,14,5,10,6,0
407-0010,10,,Y,M,,82.6,178.2,White,Not Hispanic or Latino,,26,,,,,,,,,,,,,,,,,,,,,,,,,,,,,,,,,,,,,,,,,,,
407-0010,10,2-Apr-18,Y,M,Experimental,81.5,178.2,White,Not Hispanic or Latino,30,25.7,baseline,1,cycle,3,,142,,read,0,,0,,1,,5,2,65.2,44.17,24,,24,,23,,17,19,100,28,12,27,36,32,4,,0,,3,,9,,1,,6
407-0010,10,6-Jun-18,Y,M,Experimental,84.9,,White,Not Hispanic or Latino,30,26.7,endpstTr,6,cycle,4,1,283,141,read,0,0,0,0,1,0,,,68.1,50.5,16,-8,32,8,25,2,28,31,11.25,22,14,25,36,31,4,0,6,6,4,1,7,-2,4,3,5
407-0010,10,16-Jul-18,Y,M,Experimental,84.5,,White,Not Hispanic or Latino,30,26.6,postWash,10,cycle,3,0,141,-1,read,0,0,0,0,1,0,,,,,20,-4,32,8,28,5,22,22,2.5,22,15,27,35,35,8,4,4,4,4,1,5,-4,1,0,5
407-0011,11,,,F,,76.5,166.1,White,Not Hispanic or Latino,,27.7,,,,,,,,,,,,,,,,,,,,,,,,,,,,,,,,,,,,,,,,,,,
407-0011,11,5-Apr-18,,F,Experimental,76.4,166.1,White,Not Hispanic or Latino,29,27.7,baseline,1,ellip,5,,622,,cwrdpz,2,,55,,0.714285714,,5,5,72,31.67,26,,28,,21,,14,22,82.5,20,11,27,31,28,8,,4,,8,,9,,12,,0
407-0011,11,15-Jun-18,,F,Experimental,77.2,,White,Not Hispanic or Latino,29,28,endpstTr,6,ellip,5,0,638,16,read,0,-2,0,-55,1,0.285714286,,,69,24.17,29,3,30,2,19,-2,34,33,68.75,31,15,29,27,29,12,4,2,-2,13,5,15,6,9,-3,0
407-0011,11,8-Aug-18,,F,Experimental,74.8,,White,Not Hispanic or Latino,29,27.1,postWash,10,tmill,6,1,1297,675,read,0,-2,0,-55,1,0.285714286,,,,,27,1,28,0,19,-2,34,31,60,32,16,30,29,35,12,4,4,0,14,6,15,6,10,-2,0
407-0012,12,28-Mar-18,,F,,63.2,152.6,White,Not Hispanic or Latino,28,27.1,,,,,,,,,,,,,,,,,,,,,,,,,,,,,,,,,,,,,,,,,,,
407-0012,12,16-May-18,,F,Experimental,60.4,152.6,White,Not Hispanic or Latino,28,25.9,baseline,1,tmill,1,,18,,cwrdpz,1,,18,,0.5,,5,2,71.4,11.17,15,,16,,20,,16,13,70,27,13,16,24,26,7,,0,,8,,11,,8,,0
407-0012,12,15-Aug-18,,F,Experimental,60.1,,White,Not Hispanic or Latino,28,25.8,endpstTr,6,cycle,2,1,58,40,wrdgms,0,-1,0,-18,1,0.5,,,79,3.17,23,8,19,3,20,0,22,18,50,26,15,25,28,29,9,2,0,0,9,1,14,3,9,1,4
407-0012,12,28-Sep-18,,F,Experimental,58.9,,White,Not Hispanic or Latino,28,25.3,postWash,10,cycle,3,2,141,123,cwrdpz,0,-1,0,-18,1,0.5,,,,,23,8,21,5,19,-1,20,20,50,24,16,23,21,27,8,1,0,0,8,0,14,3,8,0,0
407-0014,14,27-Apr-18,N,F,,113.4,178,White,Not Hispanic or Latino,31,35.8,,,,,,,,,,,,,,,,,,,,,,,,,,,,,,,,,,,,,,,,,,,
407-0015,15,24-Apr-18,,M,,120.5,183,White,Not Hispanic or Latino,32,36,,,,,,,,,,,,,,,,,,,,,,,,,,,,,,,,,,,,,,,,,,,
407-0015,15,30-Apr-18,,M,Experimental,118.7,183,White,Not Hispanic or Latino,32,35.4,baseline,1,cycle,3,,138,,wrdgms,3,,141,,0.5,,5,9,57.5,29.17,18,,24,,26,,13,19,83.75,21,14,22,14,24,1,,0,,6,,12,,1,,2
407-0015,15,29-Jun-18,,M,Experimental,119.2,,White,Not Hispanic or Latino,32,35.6,endpstTr,6,cycle,4,1,313,175,cwrdpz,2,-1,58,-83,0.666666667,0.166666667,,,58.5,13.33,24,6,33,9,25,-1,16,24,46.25,21,13,28,23,28,4,3,1,1,6,0,12,0,2,1,0
407-0015,15,14-Aug-18,,M,Experimental,118.2,,White,Not Hispanic or Latino,33,35.3,postWash,10,cycle,3,0,142,4,wrdgms,1,-2,38,-103,0.75,0.25,,,,,27,9,27,3,22,-4,13,18,73.75,19,12,27,17,31,2,1,4,4,7,1,13,1,4,3,1
407-0016,16,24-Apr-18,,F,,67.5,165.6,White,Not Hispanic or Latino,24,24.6,,,,,,,,,,,,,,,,,,,,,,,,,,,,,,,,,,,,,,,,,,,
407-0016,16,30-Apr-18,,F,Experimental,66.9,165.6,White,Not Hispanic or Latino,24,24.4,baseline,1,cycle,5,,623,,wrdgms,4,,306,,0.555555556,,6,8,71,29.5,24,,25,,18,,15,20,82.5,26,15,25,32,21,2,,2,,4,,14,,14,,0
407-0016,16,6-Jul-18,,F,Experimental,67.7,,White,Not Hispanic or Latino,25,24.7,endpstTr,6,cycle,4,-1,297,-326,wrdgms,3,-1,140,-166,0.571428571,0.015873016,,,63,38.33,29,5,26,1,17,-1,24,19,52.5,28,15,30,29,27,5,3,5,3,8,4,12,-2,13,-1,0
407-0016,16,16-Aug-18,,F,Experimental,68.4,,White,Not Hispanic or Latino,25,24.9,postWash,10,cycle,5,0,632,9,wrdgms,3,-1,146,-160,0.625,0.069444444,,,,,28,4,27,2,20,2,26,18,47.5,26,15,30,27,28,8,6,0,-2,6,2,13,-1,13,-1,0
407-0017,17,,,F,Experimental,,,White,Not Hispanic or Latino,,,postWash,10,,,-4,,-307,,,-4,,-291,,-0.5,,,,,20,-6,19,0,12,1,25,26,71.25,32,16,26,30,27,9,1,2,-5,7,4,12,1,10,3,1
407-0017,17,27-Apr-18,,F,,108.4,180.1,White,Not Hispanic or Latino,21,33.4,,,,,,,,,,,,,,,,,,,,,,,,,,,,,,,,,,,,,,,,,,,
407-0017,17,9-May-18,,F,Experimental,106.6,180.1,White,Not Hispanic or Latino,21,32.9,baseline,1,cycle,4,,307,,cwrdpz,4,,291,,0.5,,3,6,59.3,6.17,26,,19,,11,,16,27,22.5,27,14,19,22,18,8,,7,,3,,11,,7,,3
407-0017,17,1-Aug-18,,F,Experimental,105.3,,White,Not Hispanic or Latino,22,32.5,endpstTr,6,cycle,4,0,294,-13,wrdgms,2,-2,59,-232,0.666666667,0.166666667,,,68.3,23.33,23,-3,20,1,15,4,25,23,62.5,37,17,25,26,26,8,0,3,-4,4,1,11,0,9,2,2
407-0018,18,27-Apr-18,,M,,114.8,191.4,White,Not Hispanic or Latino,33,31.3,,,,,,,,,,,,,,,,,,,,,,,,,,,,,,,,,,,,,,,,,,,
407-0018,18,10-May-18,,M,control,114.4,191.4,White,Not Hispanic or Latino,33,31.2,baseline,1,ellip,6,,1493,,wrdgms,3,,149,,0.666666667,,5,7,80,50,23,,21,,23,,16,21,85,23,14,28,31,29,7,,5,,5,,10,,2,,0
407-0018,18,20-Jul-18,,M,control,114.7,,White,Not Hispanic or Latino,33,31.3,endpstTr,6,ellip,8,2,5277,3784,cwrdpz,4,1,479,330,0.666666667,0,,,77.4,26.67,20,-3,20,-1,23,0,31,33,50,32,14,20,25,24,9,2,8,3,8,3,10,0,5,3,0
407-0018,18,29-Aug-18,,M,control,114.2,,White,Not Hispanic or Latino,33,31.2,postWash,10,ellip,9,3,10228,8735,wrdgms,4,1,309,160,0.692307692,0.025641026,,,,,25,2,24,3,24,1,45,40,31.25,31,15,30,25,31,8,1,8,3,9,4,12,2,5,3,0
407-0019,19,9-May-18,,F,,90.1,163.6,White,Not Hispanic or Latino,35,33.7,,,,,,,,,,,,,,,,,,,,,,,,,,,,,,,,,,,,,,,,,,,
407-0019,19,18-May-18,,F,control,89.9,163.6,White,Not Hispanic or Latino,36,33.6,baseline,1,ellip,4,,299,,cwrdpz,1,,19,,0.8,,6,7,92.6,60.67,30,,27,,23,,41,13,93.75,38,20,26,29,30,8,,3,,9,,13,,7,,0
407-0019,19,1-Aug-18,,F,control,89.7,,White,Not Hispanic or Latino,36,33.5,endpstTr,6,cycle,5,1,601,302,wrdgms,0,-1,0,-19,1,0.2,,,99.5,6.17,12,-18,27,0,31,8,53,36,100,40,20,30,35,36,13,5,2,-1,12,3,16,3,16,9,0
407-0019,19,12-Sep-18,,F,control,87.8,,White,Not Hispanic or Latino,36,32.8,postWash,10,ellip,6,2,1279,980,cwrdpz,0,-1,0,-19,1,0.2,,,,,33,3,26,-1,27,4,45,25,100,40,16,15,18,18,11,3,0,-3,9,0,13,0,11,4,0
407-0020,20,17-May-18,,F,,74.2,161.4,Asian,Not Hispanic or Latino,24,28.5,,,,,,,,,,,,,,,,,,,,,,,,,,,,,,,,,,,,,,,,,,,
407-0020,20,25-May-18,,F,Experimental,74.7,161.4,Asian,Not Hispanic or Latino,24,28.7,baseline,1,ellip,2,,58,,cwrdpz,3,,141,,0.4,,5,5,91.5,57.33,22,,25,,25,,13,22,100,31,18,19,22,23,9,,1,,4,,12,,11,,0
407-0020,20,20-Jul-18,,F,Experimental,78.1,,Asian,Not Hispanic or Latino,24,30,endpstTr,6,ellip,3,1,142,84,wrdgms,3,0,138,-3,0.5,0.1,,,85.3,44.83,23,1,18,-7,22,-3,13,26,95,35,16,20,18,22,9,0,3,2,4,0,12,0,8,-3,2
407-0020,20,24-Aug-18,,F,Experimental,79.2,,Asian,Not Hispanic or Latino,25,30.4,postWash,10,cycle,2,0,62,4,cwrdpz,2,-1,61,-80,0.5,0.1,,,,,24,2,17,-8,23,-2,0,23,100,30,16,20,21,24,11,2,1,0,8,4,12,0,10,-1,2
407-0021,21,17-May-18,,M,,99,194.8,White,Not Hispanic or Latino,30,26.1,,,,,,,,,,,,,,,,,,,,,,,,,,,,,,,,,,,,,,,,,,,
407-0021,21,29-May-18,,M,Experimental,96.1,194.8,White,Not Hispanic or Latino,30,25.3,baseline,1,ellip,6,,1232,,cwrdpz,0,,0,,1,,6,6,62,40,19,,18,,18,,19,16,67.5,22,13,25,18,22,4,,5,,6,,14,,11,,0
407-0021,21,31-Jul-18,,M,Experimental,95.1,,White,Not Hispanic or Latino,30,25.1,endpstTr,6,ellip,6,0,1284,52,wrdgms,0,0,0,0,1,0,,,86,27.67,28,9,24,6,19,1,17,23,45,26,13,28,18,23,7,3,8,3,10,4,15,1,14,3,1
407-0021,21,17-Sep-18,,M,Experimental,92.8,,White,Not Hispanic or Latino,30,24.5,postWash,10,ellip,0,-6,0,-1232,read,1,1,20,20,0,-1,,,,,24,5,23,5,19,1,21,21,77.5,30,13,30,13,24,9,5,3,-2,12,6,15,1,12,1,0
407-0022,22,22-May-18,,M,,91.3,178.1,White,Not Hispanic or Latino,30,28.8,,,,,,,,,,,,,,,,,,,,,,,,,,,,,,,,,,,,,,,,,,,
407-0022,22,29-May-18,,M,control,92,178.1,White,Not Hispanic or Latino,30,29,baseline,1,tmill,5,,612,,read,0,,0,,1,,5,5,69.7,38.33,28,,31,,23,,13,21,63.75,26,12,30,29,28,11,,1,,7,,10,,4,,2
407-0022,22,13-Aug-18,,M,control,87.8,,White,Not Hispanic or Latino,30,27.7,endpstTr,6,cycle,0,-5,0,-612,cwrdpz,2,2,60,60,0,-1,,,61.3,29.5,21,-7,29,-2,21,-2,25,18,56.25,27,13,30,25,30,12,1,2,1,7,0,9,-1,4,0,0
407-0022,22,26-Sep-18,,M,control,87.9,,White,Not Hispanic or Latino,31,27.7,postWash,10,tmill,0,-5,0,-612,read,1,1,24,24,0,-1,,,,,23,-5,28,-3,23,0,25,20,13.75,25,15,30,25,30,11,0,1,0,6,-1,10,0,5,1,1
407-0023,23,30-May-18,N,F,,70.2,164,White,Not Hispanic or Latino,27,26.1,,,,,,,,,,,,,,,,,,,,,,,,,,,,,,,,,,,,,,,,,,,
,24,,,M,,,,,,,,,,,,,,,,,,,,,,,,,,,,,,,,,,,,,,,,,,,,,,,,,,
407-0025,25,15-Jun-18,,M,,71.1,169.4,Asian,Not Hispanic or Latino,35,24.8,,,,,,,,,,,,,,,,,,,,,,,,,,,,,,,,,,,,,,,,,,,
407-0025,25,27-Jun-18,,M,Experimental,70.5,169.4,Asian,Not Hispanic or Latino,35,24.6,baseline,1,cycle,4,,300,,read,0,,0,,1,,11,6,95.9,43.33,15,,26,,18,,23,21,76.25,27,17,27,17,31,13,,0,,9,,12,,7,,0
407-0025,25,3-Dec-18,,M,Experimental,71.5,,Asian,Not Hispanic or Latino,35,24.9,endpstTr,6,cycle,0,-4,0,-300,read,2,2,63,63,0,-1,,,86,10.17,15,0,33,7,19,1,19,19,93.75,34,17,27,29,28,13,0,0,0,11,2,12,0,0,-7,0
407-0025,25,26-Feb-19,,M,Experimental,69.3,,Asian,Not Hispanic or Latino,36,24.1,postWash,10,cycle,0,-4,0,-300,read,2,2,105,105,0,-1,,,,,15,0,28,2,21,3,23,23,62.5,22,13,29,33,33,12,-1,3,3,7,-2,12,0,1,-6,0
407-0026,26,7-Jun-18,,M,,95.8,189.8,White,Not Hispanic or Latino,31,26.6,,,,,,,,,,,,,,,,,,,,,,,,,,,,,,,,,,,,,,,,,,,
407-0026,26,15-Jun-18,,M,Experimental,96,189.8,White,Not Hispanic or Latino,31,26.6,baseline,1,cycle,4,,302,,cwrdpz,4,,301,,0.5,,7,8,82,55.17,24,,17,,23,,13,19,80,26,11,25,24,16,5,,2,,4,,10,,11,,1
407-0026,26,13-Aug-18,,M,Experimental,96.3,,White,Not Hispanic or Latino,31,26.7,endpstTr,6,cycle,0,-4,0,-302,cwrdpz,5,1,626,325,0,-0.5,,,81.5,40,25,1,17,0,27,4,13,19,50,20,11,26,9,18,5,0,4,2,6,2,12,2,11,0,4
407-0026,26,25-Sep-18,,M,Experimental,95.7,,White,Not Hispanic or Latino,32,26.6,postWash,10,ellip,0,-4,0,-302,cwrdpz,3,-1,135,-166,0,-0.5,,,,,26,2,20,3,26,3,13,14,46.25,17,92,6,11,14,2,-3,4,2,5,1,11,1,10,-1,1
407-0027,27,6-Jun-18,N,F,,93.2,164.3,Asian,Not Hispanic or Latino,23,34.5,,,,,,,,,,,,,,,,,,,,,,,,,,,,,,,,,,,,,,,,,,,
407-0028,28,7-Jun-18,N,F,,91.3,166.8,American Indian or Alaskan Native,Not Hispanic or Latino,33,32.8,,,,,,,,,,,,,,,,,,,,,,,,,,,,,,,,,,,,,,,,,,,
407-0029,29,18-Jun-18,,M,,88.7,181.7,White,Not Hispanic or Latino,19,26.9,,,,,,,,,,,,,,,,,,,,,,,,,,,,,,,,,,,,,,,,,,,
407-0029,29,28-Jun-18,,M,control,88.9,181.7,White,Not Hispanic or Latino,19,26.9,baseline,1,ellip,3,,148,,wrdgms,3,,142,,0.5,,3,3,25.4,13.67,25,,23,,13,,15,17,60,22,14,22,20,23,1,,2,,0,,5,,0,,0
407-0029,29,11-Sep-18,,M,control,87.1,,White,Not Hispanic or Latino,19,26.4,endpstTr,6,cycle,3,0,142,-6,wrdgms,1,-2,23,-119,0.75,0.25,,,40,18,23,-2,28,5,17,4,15,16,25,20,10,22,15,21,4,3,3,1,5,5,8,3,8,8,0
407-0029,29,23-Oct-18,,M,control,89.1,,White,Not Hispanic or Latino,20,27,postWash,10,ellip,2,-1,57,-91,read,0,-3,0,-142,1,0.5,,,,,30,5,26,3,16,3,15,21,13.75,19,82,3,10,22,3,2,1,-1,1,1,2,-3,1,1,0
407-0030,30,18-Jun-18,,F,,79.9,172.6,White,,20,26.8,,,,,,,,,,,,,,,,,,,,,,,,,,,,,,,,,,,,,,,,,,,
407-0030,30,26-Jun-18,,F,Experimental,80.4,172.6,White,,20,27,baseline,1,ellip,4,,307,,cwrdpz,0,,0,,1,,3,5,85.7,21,18,,23,,26,,13,17,95,34,17,23,25,21,8,,2,,3,,14,,8,,0
407-0030,30,31-Aug-18,,F,Experimental,79.7,,White,,20,26.8,endpstTr,6,ellip,0,-4,0,-307,cwrdpz,3,3,141,141,0,-1,,,67.5,28.17,31,13,24,1,25,-1,15,23,16.25,27,92,0,11,25,9,1,1,-1,2,-1,12,-2,8,0,0
407-0030,30,17-Oct-18,,F,Experimental,79.9,,White,,20,26.8,postWash,10,cycle,0,-4,0,-307,cwrdpz,1,1,19,19,0,-1,,,,,32,14,20,-3,27,1,13,23,23.75,38,19,20,16,24,8,0,1,-1,5,2,11,-3,7,-1,0
407-0031,31,26-Jun-18,N,M,,111.2,184.7,White,Not Hispanic or Latino,25,32.6,,,,,,,,,,,,,,,,,,,,,,,,,,,,,,,,,,,,,,,,,,,
407-0032,32,26-Jun-18,N,M,,113.9,178.8,White,Not Hispanic or Latino,39,35.6,,,,,,,,,,,,,,,,,,,,,,,,,,,,,,,,,,,,,,,,,,,
407-0033,33,18-Jun-18,N,M,,106,180.4,Black or African American,Not Hispanic or Latino,19,32.6,,,,,,,,,,,,,,,,,,,,,,,,,,,,,,,,,,,,,,,,,,,
407-0036,36,19-Jul-18,,F,,80.4,169.1,White,,19,28.1,,,,,,,,,,,,,,,,,,,,,,,,,,,,,,,,,,,,,,,,,,,
407-0037,37,6-Jul-18,,F,,99.1,166,Multi-Racial,Hispanic or Latino,32,36,,,,,,,,,,,,,,,,,,,,,,,,,,,,,,,,,,,,,,,,,,,
407-0037,37,17-Jul-18,,F,control,98.6,166,Multi-Racial,Hispanic or Latino,32,35.8,baseline,1,ellip,0,,0,,cwrdpz,8,,5135,,0,,3,7,57.3,25.5,24,,28,,23,,24,23,60,35,18,24,25,27,7,,2,,5,,8,,8,,4
407-0037,37,2-Oct-18,,F,control,97,,Multi-Racial,Hispanic or Latino,32,35.2,endpstTr,6,cycle,0,0,0,0,cwrdpz,5,-3,623,-4512,0,0,,,62,22.17,24,0,29,1,23,0,31,28,63.75,38,15,23,25,28,8,1,0,-2,4,-1,11,3,6,-2,5
407-0037,37,13-Nov-18,,F,control,96.3,,Multi-Racial,Hispanic or Latino,32,34.9,postWash,10,ellip,0,0,0,0,cwrdpz,6,-2,1264,-3871,0,0,,,,,27,3,27,-1,27,4,36,31,40,28,13,21,26,25,9,2,5,3,8,3,8,0,8,0,6
407-0038,38,26-Jul-18,,M,,95.3,181.5,White,Not Hispanic or Latino,35,28.9,,,,,,,,,,,,,,,,,,,,,,,,,,,,,,,,,,,,,,,,,,,
407-0038,38,2-Aug-18,,M,Experimental,92.5,180,White,Not Hispanic or Latino,35,28.5,baseline,1,ellip,3,,140,,read,0,,0,,1,,4,1,72,45,28,,24,,16,,28,14,100,32,17,28,30,24,8,,0,,4,,10,,7,,1
407-0038,38,28-Sep-18,,M,Experimental,93.1,,White,Not Hispanic or Latino,35,28.7,endpstTr,6,tmill,2,-1,58,-82,cwrdpz,0,0,0,0,1,0,,,84.1,43.33,11,-17,28,4,17,1,33,17,83.75,31,20,29,31,30,9,1,0,0,6,2,14,4,10,3,0
407-0038,38,5-Nov-18,,M,Experimental,93.2,,White,Not Hispanic or Latino,35,28.8,postWash,10,ellip,3,0,130,-10,read,0,0,0,0,1,0,,,,,32,4,30,6,17,1,30,14,80,36,17,25,26,28,8,0,0,0,11,7,10,0,11,4,0
407-0041,41,17-Jul-18,N,F,,102.4,174.3,White,Not Hispanic or Latino,25,33.7,,,,,,,,,,,,,,,,,,,,,,,,,,,,,,,,,,,,,,,,,,,
407-0042,42,6-Jul-18,,F,,90.1,175.4,White,Not Hispanic or Latino,35,29.3,,,,,,,,,,,,,,,,,,,,,,,,,,,,,,,,,,,,,,,,,,,
407-0042,42,13-Jul-18,,F,control,89.9,175.4,White,Not Hispanic or Latino,35,29.2,baseline,1,tmill,3,,138,,cwrdpz,3,,138,,0.5,,3,3,88,18.33,28,,30,,25,,18,15,100,25,15,25,24,29,8,,0,,9,,16,,16,,0
407-0042,42,26-Sep-18,,F,control,89.9,,White,Not Hispanic or Latino,35,29.2,endpstTr,6,tmill,6,3,1292,1154,cwrdpz,3,0,147,9,0.666666667,0.166666667,,,88.5,15,26,-2,27,-3,23,-2,23,16,100,25,14,30,24,32,8,0,1,1,9,0,16,0,16,0,0
407-0042,42,23-Nov-18,,F,control,85.4,,White,Not Hispanic or Latino,35,27.8,postWash,10,tmill,3,0,136,-2,cwrdpz,3,0,143,5,0.5,0,,,,,24,-4,28,-2,24,-1,17,17,90,27,15,30,24,30,9,1,1,1,6,-3,15,-1,14,-2,0
407-0043,43,24-Jul-18,N,F,,83.6,166.5,White,,18,30.2,,,,,,,,,,,,,,,,,,,,,,,,,,,,,,,,,,,,,,,,,,,
407-0044,44,17-Jul-18,,M,,95.5,185.8,White,Not Hispanic or Latino,29,27.7,,,,,,,,,,,,,,,,,,,,,,,,,,,,,,,,,,,,,,,,,,,
407-0044,44,27-Jul-18,,M,Experimental,94.8,185.8,White,Not Hispanic or Latino,29,27.5,baseline,1,ellip,4,,307,,read,0,,0,,1,,6,2,67.8,55.33,20,,20,,25,,18,18,82.5,38,20,16,21,22,4,,5,,4,,11,,12,,5
407-0044,44,12-Oct-18,,M,Experimental,92.8,,White,Not Hispanic or Latino,29,26.9,endpstTr,6,ellip,4,0,293,-14,wrdgms,0,0,0,0,1,0,,,65.7,39,24,4,25,5,23,-2,21,21,55,38,18,16,25,24,8,4,5,0,8,4,11,0,11,-1,4
407-0044,44,23-Nov-18,,M,Experimental,91.8,,White,Not Hispanic or Latino,29,26.6,postWash,10,ellip,4,0,313,6,read,0,0,0,0,1,0,,,,,30,10,26,6,24,-1,22,18,35,28,19,24,29,29,9,5,6,1,8,4,10,-1,12,0,6
407-0045,45,13-Aug-18,,F,,70.7,164.3,White,Hispanic or Latino,23,26.2,,,,,,,,,,,,,,,,,,,,,,,,,,,,,,,,,,,,,,,,,,,
407-0045,45,29-Aug-18,,F,Experimental,68.8,164.3,White,Hispanic or Latino,23,25.5,baseline,1,ellip,4,,304,,cwrdpz,2,,58,,0.666666667,,10,9,68,67,,,,,,,,,0,,,,,,0,,0,,0,,0,,0,,0
407-0045,45,5-Dec-18,,F,Experimental,72.9,,White,Hispanic or Latino,23,27,endpstTr,6,cycle,2,-2,62,-242,read,2,0,61,3,0.5,-0.166666667,,,57.9,44.33,25,25,25,25,18,18,29,13,73.75,27,11,30,24,30,10,10,6,6,12,12,14,14,10,10,1
407-0045,45,20-Feb-19,,F,Experimental,73.6,,White,Hispanic or Latino,24,27.3,postWash,10,ellip,0,-4,0,-304,read,3,1,140,82,0,-0.666666667,,,,,26,26,29,29,17,17,37,14,58.75,28,13,23,25,30,11,11,3,3,13,13,14,14,13,13,5
407-0046,46,13-Aug-18,,M,,101,182.2,White,,26,30.4,,,,,,,,,,,,,,,,,,,,,,,,,,,,,,,,,,,,,,,,,,,
407-0046,46,27-Aug-18,,M,Experimental,98.1,162.2,White,,26,37.3,baseline,1,tmill,6,,1264,,read,1,,20,,0.857142857,,1,3,92,30.83,24,,20,,24,,20,27,70,39,16,25,30,30,12,,7,,12,,15,,8,,0
407-0046,46,29-Nov-18,,M,Experimental,98.1,,White,,26,37.3,endpstTr,6,ellip,2,-4,57,-1207,read,2,1,127,107,0.5,-0.357142857,,,97,34.17,29,5,31,11,30,6,31,44,80,40,20,26,31,30,12,0,10,3,13,1,13,-2,16,8,4
407-0046,46,16-Jan-19,,M,Experimental,101.6,,White,,26,38.6,postWash,10,ellip,4,-2,310,-954,read,1,0,21,1,0.8,-0.057142857,,,,,28,4,32,12,26,2,31,42,78.75,38,13,25,27,30,11,-1,9,2,15,3,14,-1,15,7,3
407-0047,47,14-Sep-18,,F,,71.3,162,White,Not Hispanic or Latino,30,27.2,,,,,,,,,,,,,,,,,,,,,,,,,,,,,,,,,,,,,,,,,,,
407-0047,47,25-Sep-18,,F,control,69.5,162,White,Not Hispanic or Latino,30,26.5,baseline,1,ellip,3,,136,,read,0,,0,,1,,5,5,89.6,22.33,25,,26,,23,,43,28,62.5,33,19,25,30,30,12,,3,,8,,8,,4,,1
407-0047,47,27-Nov-18,,F,control,72.7,,White,Not Hispanic or Latino,31,27.7,endpstTr,6,tmill,3,0,129,-7,read,0,0,0,0,1,0,,,91.4,55,26,1,29,3,17,-6,43,29,67.5,40,18,23,27,29,12,0,6,3,12,4,11,3,7,3,3
407-0047,47,9-Jan-19,,F,control,73,,White,Not Hispanic or Latino,31,27.8,postWash,10,ellip,3,0,133,-3,cwrdpz,0,0,0,0,1,0,,,,,26,1,32,6,21,-2,51,38,57.5,36,20,25,30,27,12,0,7,4,12,4,10,2,7,3,4
407-0048,48,14-Sep-18,,F,,66.7,152,Asian,Not Hispanic or Latino,32,28.9,,,,,,,,,,,,,,,,,,,,,,,,,,,,,,,,,,,,,,,,,,,
407-0048,48,28-Sep-18,,F,control,66.3,152,Asian,Not Hispanic or Latino,32,28.7,baseline,1,ellip,0,,0,,cwrdpz,2,,57,,0,,4,5,59.5,7.5,28,,21,,16,,19,13,73.75,26,11,20,6,23,4,,10,,3,,5,,7,,3
407-0048,48,14-Dec-18,,F,control,65.7,,Asian,Not Hispanic or Latino,32,28.4,endpstTr,6,ellip,0,0,0,0,cwrdpz,3,1,131,74,0,0,,,76.2,7.5,26,-2,30,9,19,3,34,22,60,34,13,24,24,25,6,2,7,-3,4,1,9,4,9,2,0
407-0048,48,13-Feb-19,,F,control,65.7,,Asian,Not Hispanic or Latino,32,28.4,postWash,10,tmill,0,0,0,0,cwrdpz,3,1,152,95,0,0,,,,,25,-3,28,7,19,3,27,20,80,30,12,30,26,30,9,5,7,-3,8,5,11,6,10,3,0
,49,,,F,,,,,,,,,,,,,,,,,,,,,,,,,,,,,,,,,,,,,,,,,,,,,,,,,,
407-0050,50,14-Sep-18,N,F,,108.5,176,White,Not Hispanic or Latino,23,35,,,,,,,,,,,,,,,,,,,,,,,,,,,,,,,,,,,,,,,,,,,
407-0051,51,19-Sep-18,,M,,89.1,185.4,White,,32,25.9,,,,,,,,,,,,,,,,,,,,,,,,,,,,,,,,,,,,,,,,,,,
407-0051,51,26-Sep-18,,M,control,88.2,185.4,White,,32,25.7,baseline,1,cycle,3,,139,,cwrdpz,0,,0,,1,,1,2,63.1,8.5,19,,22,,24,,13,24,77.5,22,16,23,13,30,6,,1,,2,,7,,3,,0