id,timestamp,female,over30,english,uk,babyin2yrs,fertilitybaby,consent1,consent2,consent3,consent4,consent5,consent6,consent7,consent8,consent9,consent10,consent11,consent12,consent13,lastbirthyr,lastbirthmth,fertrx,ivf,icsi,iui,oi,donoregg,donorsperm,pgd,frozenegguse,fet,ssr,otherfertrx,whatotherfertrx,fertproblems,nopartner,samesex,surrogate,wantedpgd,otherreasons,whatotherreasons,lmup1,lmup2,lmup3,lmup4,lmup5,lmup6___0,lmup6___1,lmup6___2,lmup6___3,lmup6___4,lmup6___5,lmup6___6,lmup6___7,lmup6___8,lmup6___9,lmup6___10,lmup6___11,lmup6_other,breastfeeding,excbreastfeeding,excbfeedtime,bfeedtime,easetoconceive,sex_withman,firstsex,contraception_first,contrafirst_other,whynocontra,whynocontra_other,contrafirst_when,contrafirst_sexfirst,emergency,emerg_when,emergmore_when,contraother,other_excbf,other_withdraw,other_natfamplan,other_mcondom,other_fcondom,other_diaphragm,other_coc,other_pop,other_pill,other_patch,other_ring,other_inj,other_ius,other_iud,other_imp,other_vasect,other_fsteri,contrafirstnotbf_when,contradispreg,hcpantenat,contradisbirth,hcp_matpostnat,contradispostnat,hcp6weeks,pregsincebirth,contratilnow,contratilnow_other,preg_now,morechildren,fertrx_current,fertrx_recent,typefertrx_current,typefertrx_recent,lmup7,lmup8,lmup9,lmup10,lmup11,lmup12___0,lmup12___1,lmup12___2,lmup12___3,lmup12___4,lmup12___5,lmup12___6,lmup12___7,lmup12___8,lmup12___9,lmup12___10,lmup12___11,lmup12_other,children,fertrx_otherchildren,ivf2,icsi2,iui2,oi2,donoregg2,donorsperm2,pgd2,frozenegguse2,fet2,ssr2,otherfertrx2,otherfertr_other,unsuccessfert_rx,us_ivf,us_icsi,us_iui,us_oi,us_donoregg,us_donorsperm,us_pgd,us_frozenegguse,us_frozenembryotransfer,us_ssr,us_fertrx_other,us_fertrx_whatother,age,ukregion,ethnicity,ethnicity_white,ethnicity_mixed,ethnicity_asian,ethnicity_black,ethnicity_other,ethnicity_other_desc,relationship,relationship_duration,education,ed_other,recruitment,recruit_social,recruitsocial_other,recruit_other,comments_study,screenfail,consentfail,ivfgroup,nocontraceptionfirst,surveydate1,surveydate_b1,lastbirthyrs,lastbirthmths,lastbirthdates,lastbirthday,lastbirthdate,dayspostpartum,dayspp_cat,lmup,lmups1,lmups5,lmups6,lmup6_10extra,lmups6rowtotal,lmup_mr,lmups1_mr,lmups5_mr,lmups6_mr,lmups12rowtotal,lmup_cat,lmupmr_cat,contrafirstLARC,otherppLARC,otherpphormone,contrafirsthormone,unsafesex
1,13/04/2021 12:35,yes,yes,yes,yes,yes,,Yes,Yes,Yes,Yes,Yes,Yes,Yes,Yes,Yes,Yes,Yes,Yes,Yes,2021,03,No,no,no,no,no,no,no,no,no,no,no,no,,no,no,no,no,no,no,,"I/we were using contraception, but not on every occasion",Right time,My intentions kept changing,I had mixed feelings about having a baby,"My partner and I had discussed having children together, but hadnt agreed for me to get pregnant",Unchecked,Unchecked,Checked,Unchecked,Unchecked,Unchecked,Unchecked,Unchecked,Unchecked,Unchecked,Unchecked,Unchecked,,Yes,"Yes, I fed my baby breast milk only",,,Quite easy,No,,male condoms,,,,,No,No,,,No,no,no,no,no,no,no,no,no,no,no,no,no,no,no,no,no,no,,Yes,,Yes,,Yes,,No,,,,,,,,,,,,,,Unchecked,Unchecked,Unchecked,Unchecked,Unchecked,Unchecked,Unchecked,Unchecked,Unchecked,Unchecked,Unchecked,Unchecked,,3,No,no,no,no,no,no,no,no,no,no,no,no,,No,no,no,no,no,no,no,no,no,no,no,no,,42,London,White,White English/ Welsh/ Scottish/ Northern Irish/ British,,,,,,Married and living with husband,5 years or more,Postgraduate degree (e.g Masters or PhD),,Told by a friend or colleague,,,,Only so far 4 weeks post patting so can't comment on Brest feeding but fed other two for 2 years,0,0,0,0,13/04/2021,13apr2021,2021,03,15032021,15,15mar2021,29,<=1 month,7,1,1,1,0,1,,,,0,0, ambivalent,,0,0,0,0,
2,13/04/2021 15:23,yes,yes,yes,yes,yes,,Yes,Yes,Yes,Yes,Yes,Yes,Yes,Yes,Yes,Yes,Yes,Yes,Yes,2019,10,No,no,no,no,no,no,no,no,no,no,no,no,,no,no,no,no,no,no,,I/we were not using contraception,Right time,I intended to get pregnant,I wanted to have a baby,My partner and I had agreed that we would like me to be pregnant,Unchecked,Checked,Checked,Unchecked,Unchecked,Unchecked,Unchecked,Unchecked,Unchecked,Unchecked,Unchecked,Unchecked,,Yes,"Yes, I fed my baby breast milk only",6 months or later,6 months or later,Very easy,Yes,6 months or later,male condoms,,,,6 months or later,No,No,,,Yes,no,no,no,no,no,no,yes,no,no,no,no,no,no,no,no,no,no,,No,,No,,Yes,Offered pop,No,I/we have always used contraception,,,,,,,,,,,,,Unchecked,Unchecked,Unchecked,Unchecked,Unchecked,Unchecked,Unchecked,Unchecked,Unchecked,Unchecked,Unchecked,Unchecked,,2,No,no,no,no,no,no,no,no,no,no,no,no,,No,no,no,no,no,no,no,no,no,no,no,no,,37,London,White,White English/ Welsh/ Scottish/ Northern Irish/ British,,,,,,"Never married, in a relationship and living together",5 years or more,Undergraduate degree (e.g. BA or BSc) or nursing or teaching qualification,,Saw an advert on social media,Physician Mums Group PMGUK,,,,0,0,0,0,13/04/2021,13apr2021,2019,10,15102019,15,15oct2019,546,after 18 months but before 2 yrs,12,2,2,2,0,2,,,,0,0,planned,,0,0,1,0,
3,13/04/2021 15:22,yes,yes,yes,yes,yes,,Yes,Yes,Yes,Yes,Yes,Yes,Yes,Yes,Yes,Yes,Yes,Yes,Yes,2019,06,No,no,no,no,no,no,no,no,no,no,no,no,,no,no,no,no,no,no,,I/we were not using contraception,"OK, but not quite right time",I intended to get pregnant,I wanted to have a baby,My partner and I had agreed that we would like me to be pregnant,Unchecked,Unchecked,Unchecked,Unchecked,Unchecked,Unchecked,Unchecked,Unchecked,Unchecked,Unchecked,Unchecked,Checked,,Yes,"No, I sometimes fed my baby breastmilk and sometimes formula (mixed feeding)",,6 weeks to 3 months,Neither easy nor difficult,Yes,3 weeks or earlier,IUS,,,,6 weeks to 3 months,Yes,No,,,No,no,no,no,no,no,no,no,no,no,no,no,no,no,no,no,no,no,,No,,No,,No,,No,I/we have always used contraception,,,,,,,,,,,,,Unchecked,Unchecked,Unchecked,Unchecked,Unchecked,Unchecked,Unchecked,Unchecked,Unchecked,Unchecked,Unchecked,Unchecked,,3,No,no,no,no,no,no,no,no,no,no,no,no,,No,no,no,no,no,no,no,no,no,no,no,no,,36,Wales,White,White English/ Welsh/ Scottish/ Northern Irish/ British,,,,,,Married and living with husband,5 years or more,Postgraduate degree (e.g Masters or PhD),,Other,,,Facebook physician mum group,,0,0,0,0,13/04/2021,13apr2021,2019,06,15062019,15,15jun2019,668,after 18 months but before 2 yrs,9,2,2,0,0,0,,,,0,0, ambivalent,,1,0,0,1,1
4,13/04/2021 15:27,yes,yes,yes,yes,yes,,Yes,Yes,Yes,Yes,Yes,Yes,Yes,Yes,Yes,Yes,Yes,Yes,Yes,2019,11,No,no,no,no,no,no,no,no,no,no,no,no,,no,no,no,no,no,no,,I/we were not using contraception,Right time,I intended to get pregnant,I wanted to have a baby,My partner and I had agreed that we would like me to be pregnant,Unchecked,Checked,Checked,Unchecked,Checked,Checked,Unchecked,Unchecked,Checked,Unchecked,Unchecked,Unchecked,,Yes,"Yes, I fed my baby breast milk only",6 months or later,6 months or later,Very easy,Yes,6 weeks to 3 months,pill (POP),,,,6 weeks to 3 months,No,No,,,No,no,no,no,no,no,no,no,no,no,no,no,no,no,no,no,no,no,,No,,Yes,"They just said to consider what I was going to use for contraception, no specific advice",Yes,GP discussed it and prescribed the pill at that appointment ,Yes,,,Yes,,No,,,,I/we were not using contraception,Right time,I intended to get pregnant,I wanted to have a baby,My partner and I had agreed that we would like me to be pregnant,Unchecked,Checked,Checked,Unchecked,Checked,Checked,Checked,Unchecked,Checked,Unchecked,Unchecked,Unchecked,,1,,no,no,no,no,no,no,no,no,no,no,no,,No,no,no,no,no,no,no,no,no,no,no,no,,34,South West England,White,White English/ Welsh/ Scottish/ Northern Irish/ British,,,,,,Married and living with husband,5 years or more,Undergraduate degree (e.g. BA or BSc) or nursing or teaching qualification,,Saw an advert on social media,Physician Mums Group PMGUK,,,,0,0,0,0,13/04/2021,13apr2021,2019,11,15112019,15,15nov2019,515,after 12 months but before 18 months,12,2,2,2,0,5,12,2,2,2,6,planned,planned,0,0,0,1,
5,13/04/2021 15:25,yes,yes,yes,yes,yes,,Yes,Yes,Yes,Yes,Yes,Yes,Yes,Yes,Yes,Yes,Yes,Yes,Yes,2020,04,No,no,no,no,no,no,no,no,no,no,no,no,,no,no,no,no,no,no,,I/we were not using contraception,"OK, but not quite right time",I intended to get pregnant,I wanted to have a baby,My partner and I had agreed that we would like me to be pregnant,Checked,Unchecked,Checked,Unchecked,Unchecked,Unchecked,Unchecked,Unchecked,Checked,Unchecked,Unchecked,Unchecked,,Yes,"No, I sometimes fed my baby breastmilk and sometimes formula (mixed feeding)",,After 3 months but before 6 months,Neither easy nor difficult,Yes,After 3 months but before 6 months,male condoms,,,,After 3 months but before 6 months,Yes,No,,,Yes,no,no,no,no,no,no,no,no,no,no,no,no,no,no,yes,no,no,,No,,No,,Yes,,No,"I/we were using contraception, but not on every occasion",,,,,,,,,,,,,Unchecked,Unchecked,Unchecked,Unchecked,Unchecked,Unchecked,Unchecked,Unchecked,Unchecked,Unchecked,Unchecked,Unchecked,,2,No,no,no,no,no,no,no,no,no,no,no,no,,No,no,no,no,no,no,no,no,no,no,no,no,,41,South West England,White,White English/ Welsh/ Scottish/ Northern Irish/ British,,,,,,Married and living with husband,5 years or more,Undergraduate degree (e.g. BA or BSc) or nursing or teaching qualification,,Saw an advert on social media,Physician Mums Group PMGUK,,,,0,0,0,0,13/04/2021,13apr2021,2020,04,15042020,15,15apr2020,363,after 12 months but before 18 months,11,2,2,2,0,3,,,,0,0,planned,,0,1,1,0,1
6,13/04/2021 15:29,yes,yes,yes,yes,yes,,Yes,Yes,Yes,Yes,Yes,Yes,Yes,Yes,Yes,Yes,Yes,Yes,Yes,2019,09,No,no,no,no,no,no,no,no,no,no,no,no,,no,no,no,no,no,no,,I/we were not using contraception,Right time,I intended to get pregnant,I wanted to have a baby,My partner and I had agreed that we would like me to be pregnant,Unchecked,Checked,Checked,Unchecked,Checked,Checked,Checked,Checked,Unchecked,Unchecked,Unchecked,Unchecked,,Yes,"No, I sometimes fed my baby breastmilk and sometimes formula (mixed feeding)",,6 months or later,Neither easy nor difficult,Yes,6 weeks to 3 months,pill (POP),,,,6 weeks to 3 months,No,No,,,No,no,no,no,no,no,no,no,no,no,no,no,no,no,no,no,no,no,,No,,No,,Yes,At the postnatal review appointment ,No,"I/we were using contraception, but stopped in order to try and get pregnant",,,,,,,,,,,,,Unchecked,Unchecked,Unchecked,Unchecked,Unchecked,Unchecked,Unchecked,Unchecked,Unchecked,Unchecked,Unchecked,Unchecked,,1,,no,no,no,no,no,no,no,no,no,no,no,,No,no,no,no,no,no,no,no,no,no,no,no,,32,South East England,White,White English/ Welsh/ Scottish/ Northern Irish/ British,,,,,,Married and living with husband,5 years or more,Postgraduate degree (e.g Masters or PhD),,Saw an advert on social media,Physician Mums Group PMGUK,,,,0,0,0,0,13/04/2021,13apr2021,2019,09,15092019,15,15sep2019,576,after 18 months but before 2 yrs,12,2,2,2,0,6,,,,0,0,planned,,0,0,0,1,
7,13/04/2021 15:28,yes,yes,yes,yes,yes,,Yes,Yes,Yes,Yes,Yes,Yes,Yes,Yes,Yes,Yes,Yes,Yes,Yes,2020,12,No,no,no,no,no,no,no,no,no,no,no,no,,no,no,no,no,no,no,,I/we were not using contraception,Right time,I intended to get pregnant,I wanted to have a baby,My partner and I had agreed that we would like me to be pregnant,Checked,Unchecked,Unchecked,Unchecked,Unchecked,Unchecked,Unchecked,Checked,Unchecked,Unchecked,Unchecked,Unchecked,,Yes,"Yes, I fed my baby breast milk only",I am still exclusively breastfeeding,I am still breastfeeding,Quite difficult,Yes,6 weeks to 3 months,exclusive breastfeeding only,,,,3 weeks or earlier,No,No,,,No,no,no,no,no,no,no,no,no,no,no,no,no,no,no,no,no,no,,No,,No,,Yes,,No,I/we have never used contraception,,,,,,,,,,,,,Unchecked,Unchecked,Unchecked,Unchecked,Unchecked,Unchecked,Unchecked,Unchecked,Unchecked,Unchecked,Unchecked,Unchecked,,1,,no,no,no,no,no,no,no,no,no,no,no,,No,no,no,no,no,no,no,no,no,no,no,no,,32,East Midlands,White,Any other White background,,,,,,Married and living with husband,5 years or more,Postgraduate degree (e.g Masters or PhD),,Other,,,Physicians mum U.K. Facebook group ,,0,0,0,0,13/04/2021,13apr2021,2020,12,15122020,15,15dec2020,119, after 3 months but before 6 months,12,2,2,2,0,2,,,,0,0,planned,,0,0,0,0,
8,13/04/2021 15:29,yes,yes,yes,yes,yes,,Yes,Yes,Yes,No,Yes,Yes,Yes,Yes,Yes,Yes,Yes,Yes,Yes,2019,07,No,no,no,no,no,no,no,no,no,no,no,no,,no,no,no,no,no,no,,I/we were not using contraception,Right time,I intended to get pregnant,I wanted to have a baby,My partner and I had agreed that we would like me to be pregnant,Checked,Unchecked,Unchecked,Unchecked,Unchecked,Unchecked,Unchecked,Unchecked,Unchecked,Unchecked,Unchecked,Unchecked,,No,,,,Neither easy nor difficult,Yes,6 weeks to 3 months,male condoms,,,,6 weeks to 3 months,No,No,,,No,no,no,no,no,no,no,no,no,no,no,no,no,no,no,no,no,no,,No,,No,,Yes,Discussed at 6 week check with GP,Yes,,,Yes,,No,,,,I/we were not using contraception,Right time,I intended to get pregnant,I wanted to have a baby,My partner and I had agreed that we would like me to be pregnant,Checked,Unchecked,Unchecked,Unchecked,Unchecked,Unchecked,Unchecked,Unchecked,Unchecked,Unchecked,Unchecked,Unchecked,,1,,no,no,no,no,no,no,no,no,no,no,no,,No,no,no,no,no,no,no,no,no,no,no,no,,32,London,White,White English/ Welsh/ Scottish/ Northern Irish/ British,,,,,,Married and living with husband,5 years or more,Postgraduate degree (e.g Masters or PhD),,Saw an advert on social media,Physician Mums Group PMGUK,,,,0,0,0,0,13/04/2021,13apr2021,2019,07,15072019,15,15jul2019,638,after 18 months but before 2 yrs,11,2,2,1,0,1,11,2,2,1,1,planned,planned,0,0,0,0,
9,13/04/2021 15:29,yes,yes,yes,yes,yes,,Yes,Yes,Yes,Yes,Yes,Yes,Yes,Yes,Yes,Yes,Yes,Yes,Yes,2021,03,No,no,no,no,no,no,no,no,no,no,no,no,,no,no,no,no,no,no,,I/we were not using contraception,Right time,I intended to get pregnant,I wanted to have a baby,My partner and I had agreed that we would like me to be pregnant,Unchecked,Unchecked,Unchecked,Unchecked,Unchecked,Unchecked,Unchecked,Unchecked,Unchecked,Unchecked,Unchecked,Checked,,Yes,"Yes, I fed my baby breast milk only",I am still exclusively breastfeeding,I am still breastfeeding,Very easy,No,,no method used,,I have not had sex,,,,,,,,no,no,no,no,no,no,no,no,no,no,no,no,no,no,no,no,no,,Yes,,Yes,,Yes,Not yet had 6-8 week check but midwife did at each postnatal visit ,No,,,,,,,,,,,,,,Unchecked,Unchecked,Unchecked,Unchecked,Unchecked,Unchecked,Unchecked,Unchecked,Unchecked,Unchecked,Unchecked,Unchecked,,2,No,no,no,no,no,no,no,no,no,no,no,no,,No,no,no,no,no,no,no,no,no,no,no,no,,34,East Midlands,White,White English/ Welsh/ Scottish/ Northern Irish/ British,,,,,,Married and living with husband,5 years or more,Undergraduate degree (e.g. BA or BSc) or nursing or teaching qualification,,Saw an advert on social media,Physician Mums Group PMGUK,,,,0,0,0,1,13/04/2021,13apr2021,2021,03,15032021,15,15mar2021,29,<=1 month,10,2,2,0,0,0,,,,0,0,planned,,0,0,0,0,
11,13/04/2021 15:30,yes,yes,yes,yes,yes,,Yes,Yes,Yes,Yes,Yes,Yes,Yes,Yes,Yes,Yes,Yes,Yes,Yes,2020,02,Yes,yes,no,no,no,no,no,no,no,no,no,no,,yes,no,no,no,no,no,,As part of fertility treatment (e.g. IVF) I/we were using contraception,Right time,I intended to get pregnant,I wanted to have a baby,My partner and I had agreed that we would like me to be pregnant,Checked,Checked,Checked,Unchecked,Checked,Checked,Checked,Checked,Checked,Checked,Unchecked,Unchecked,,Yes,"Yes, I fed my baby breast milk only",After 3 months but before 6 months,6 months or later,Very difficult,Yes,6 weeks to 3 months,male condoms,,,,6 weeks to 3 months,No,No,,,No,no,no,no,no,no,no,no,no,no,no,no,no,no,no,no,no,no,,No,,No,,Yes,6week check with GP,No,"I/we have been using contraception, as part of fertility treatment e.g. IVF",,,,,,,,,,,,,Unchecked,Unchecked,Unchecked,Unchecked,Unchecked,Unchecked,Unchecked,Unchecked,Unchecked,Unchecked,Unchecked,Unchecked,,1,,no,no,no,no,no,no,no,no,no,no,no,,No,no,no,no,no,no,no,no,no,no,no,no,,32,South West England,White,White English/ Welsh/ Scottish/ Northern Irish/ British,,,,,,Married and living with husband,5 years or more,Undergraduate degree (e.g. BA or BSc) or nursing or teaching qualification,,Saw an advert on social media,Physician Mums Group PMGUK,,,,0,0,1,0,13/04/2021,13apr2021,2020,02,15022020,15,15feb2020,423,after 12 months but before 18 months,12,2,2,2,0,9,,,,0,0,planned,,0,0,0,0,
12,13/04/2021 15:31,yes,yes,yes,yes,yes,,Yes,Yes,Yes,Yes,Yes,Yes,Yes,Yes,Yes,Yes,Yes,Yes,Yes,2019,06,No,no,no,no,no,no,no,no,no,no,no,no,,no,no,no,no,no,no,,I/we were not using contraception,Right time,I intended to get pregnant,I wanted to have a baby,My partner and I had agreed that we would like me to be pregnant,Checked,Unchecked,Unchecked,Unchecked,Checked,Checked,Checked,Unchecked,Unchecked,Unchecked,Unchecked,Unchecked,,Yes,"Yes, I fed my baby breast milk only",6 weeks to 3 months,6 months or later,Neither easy nor difficult,Yes,6 weeks to 3 months,pill (POP),,,,6 weeks to 3 months,No,No,,,Yes,no,no,no,yes,no,no,yes,no,no,no,no,no,no,no,no,no,no,,No,,No,,Yes,,Yes,,,Yes,,No,,,,I/we were not using contraception,Right time,I intended to get pregnant,I wanted to have a baby,My partner and I had agreed that we would like me to be pregnant,Checked,Checked,Unchecked,Unchecked,Checked,Unchecked,Unchecked,Unchecked,Unchecked,Unchecked,Unchecked,Unchecked,,1,,no,no,no,no,no,no,no,no,no,no,no,,No,no,no,no,no,no,no,no,no,no,no,no,,35,Northern Ireland,White,White Irish,,,,,,Married and living with husband,5 years or more,Undergraduate degree (e.g. BA or BSc) or nursing or teaching qualification,,Told by a friend or colleague,,,,,0,0,0,0,13/04/2021,13apr2021,2019,06,15062019,15,15jun2019,668,after 18 months but before 2 yrs,12,2,2,2,0,4,12,2,2,2,3,planned,planned,0,0,1,1,
13,13/04/2021 15:31,yes,yes,yes,yes,yes,,Yes,Yes,Yes,Yes,Yes,Yes,Yes,Yes,Yes,Yes,Yes,Yes,Yes,2020,12,No,no,no,no,no,no,no,no,no,no,no,no,,no,no,no,no,no,no,,I/we were not using contraception,Right time,I intended to get pregnant,I wanted to have a baby,My partner and I had agreed that we would like me to be pregnant,Unchecked,Checked,Unchecked,Unchecked,Unchecked,Unchecked,Unchecked,Unchecked,Unchecked,Unchecked,Unchecked,Unchecked,,Yes,"Yes, I fed my baby breast milk only",I am still exclusively breastfeeding,I am still breastfeeding,Very difficult,No,,pill (POP),,,,6 weeks to 3 months,No,No,,,No,no,no,no,no,no,no,no,no,no,no,no,no,no,no,no,no,no,,Yes,,Yes,,Yes,,No,I/we have always used contraception,,,,,,,,,,,,,Unchecked,Unchecked,Unchecked,Unchecked,Unchecked,Unchecked,Unchecked,Unchecked,Unchecked,Unchecked,Unchecked,Unchecked,,1,,no,no,no,no,no,no,no,no,no,no,no,,No,no,no,no,no,no,no,no,no,no,no,no,,32,Scotland,White,White English/ Welsh/ Scottish/ Northern Irish/ British,,,,,,Married and living with husband,3 to 5 years,Undergraduate degree (e.g. BA or BSc) or nursing or teaching qualification,,Saw an advert on social media,Physician Mums Group PMGUK,,,,0,0,0,0,13/04/2021,13apr2021,2020,12,15122020,15,15dec2020,119, after 3 months but before 6 months,11,2,2,1,0,1,,,,0,0,planned,,0,0,0,1,
14,13/04/2021 15:33,yes,yes,yes,yes,yes,,Yes,Yes,Yes,Yes,Yes,Yes,Yes,Yes,Yes,Yes,Yes,Yes,Yes,2020,09,No,no,no,no,no,no,no,no,no,no,no,no,,no,no,no,no,no,no,,I/we were not using contraception,"OK, but not quite right time",I intended to get pregnant,I had mixed feelings about having a baby,My partner and I had agreed that we would like me to be pregnant,Unchecked,Unchecked,Unchecked,Unchecked,Unchecked,Unchecked,Unchecked,Unchecked,Unchecked,Unchecked,Unchecked,Checked,,Yes,"Yes, I fed my baby breast milk only",I am still exclusively breastfeeding,I am still breastfeeding,Neither easy nor difficult,No,,female sterilisation,,,,3 weeks or earlier,No,No,,,No,no,no,no,no,no,no,no,no,no,no,no,no,no,no,no,no,no,,Yes,,Yes,,Yes,,No,Other,Not had sex!,,,,,,,,,,,,Unchecked,Unchecked,Unchecked,Unchecked,Unchecked,Unchecked,Unchecked,Unchecked,Unchecked,Unchecked,Unchecked,Unchecked,,2,No,no,no,no,no,no,no,no,no,no,no,no,,No,no,no,no,no,no,no,no,no,no,no,no,,,Scotland,White,White English/ Welsh/ Scottish/ Northern Irish/ British,,,,,,Married and living with husband,5 years or more,Undergraduate degree (e.g. BA or BSc) or nursing or teaching qualification,,Saw an advert on social media,Physician Mums Group PMGUK,,,,0,0,0,0,13/04/2021,13apr2021,2020,09,15092020,15,15sep2020,210,after 6 months but before 12 months,8,2,2,0,0,0,,,,0,0, ambivalent,,0,0,0,0,
15,13/04/2021 16:06,yes,yes,yes,yes,yes,,Yes,Yes,Yes,Yes,Yes,Yes,Yes,Yes,Yes,Yes,Yes,Yes,Yes,2019,02,No,no,no,no,no,no,no,no,no,no,no,no,,no,no,no,no,no,no,,I/we were not using contraception,Right time,I intended to get pregnant,I wanted to have a baby,My partner and I had agreed that we would like me to be pregnant,Unchecked,Checked,Checked,Unchecked,Checked,Checked,Checked,Checked,Checked,Unchecked,Unchecked,Unchecked,,Yes,"No, I sometimes fed my baby breastmilk and sometimes formula (mixed feeding)",,3 weeks or earlier,Quite easy,Yes,6 weeks to 3 months,male condoms,,,,6 weeks to 3 months,No,No,,,Yes,no,no,no,no,no,no,no,yes,no,no,no,no,yes,no,no,no,no,,Yes,Midwife mentioned I think ,No,,Yes,Briefly mentioned,No,I/we have always used contraception,,,,,,,,,,,,,Unchecked,Unchecked,Unchecked,Unchecked,Unchecked,Unchecked,Unchecked,Unchecked,Unchecked,Unchecked,Unchecked,Unchecked,,1,,no,no,no,no,no,no,no,no,no,no,no,,No,no,no,no,no,no,no,no,no,no,no,no,,30,East Midlands,White,White English/ Welsh/ Scottish/ Northern Irish/ British,,,,,,Married and living with husband,5 years or more,Postgraduate degree (e.g Masters or PhD),,Saw an advert on social media,Physician Mums Group PMGUK,,,,0,0,0,0,13/04/2021,13apr2021,2019,02,15022019,15,15feb2019,788,over 2 yrs,12,2,2,2,0,7,,,,0,0,planned,,0,1,1,0,
16,13/04/2021 15:34,yes,yes,yes,yes,yes,,Yes,Yes,Yes,Yes,Yes,Yes,Yes,Yes,Yes,Yes,Yes,Yes,Yes,2019,06,No,no,no,no,no,no,no,no,no,no,no,no,,no,no,no,no,no,no,,I/we were not using contraception,Right time,I intended to get pregnant,I wanted to have a baby,My partner and I had agreed that we would like me to be pregnant,Checked,Unchecked,Unchecked,Unchecked,Unchecked,Unchecked,Unchecked,Unchecked,Unchecked,Unchecked,Unchecked,Unchecked,,Yes,"Yes, I fed my baby breast milk only",6 months or later,6 months or later,Very easy,Yes,3 weeks or earlier,withdrawal,,,,6 months or later,Yes,No,,,No,no,no,no,no,no,no,no,no,no,no,no,no,no,no,no,no,no,,Yes,,No,,Yes,,No,I/we have always used contraception,,,,,,,,,,,,,Unchecked,Unchecked,Unchecked,Unchecked,Unchecked,Unchecked,Unchecked,Unchecked,Unchecked,Unchecked,Unchecked,Unchecked,,2,No,no,no,no,no,no,no,no,no,no,no,no,,No,no,no,no,no,no,no,no,no,no,no,no,,37,London,White,Any other White background,,,,,,Married and living with husband,5 years or more,Postgraduate degree (e.g Masters or PhD),,Saw an advert on social media,Physician Mums Group PMGUK,,,,0,0,0,0,13/04/2021,13apr2021,2019,06,15062019,15,15jun2019,668,after 18 months but before 2 yrs,11,2,2,1,0,1,,,,0,0,planned,,0,0,0,0,1