identifier,group,severityLD,autism,physical,mobility,sensory,epilepsy,constipation,education,ageChild,sexChild,ethnChild,RespondentDet,ageParent,relationshipParent,mentalhealth,achodrug,FamViolence,livingParent,employParent,mainIncParentSalWag,mainIncParentFamSup,mainIncParentStatBe,mainIncParentOther,benefitParentIncSupp,benefitParentHousing,benefitParentJobSeek,benefitParentChildBe,benefitParentOther,ethnParent,mullenVisualT,mullenFinemotorT,mullenReceptiveT,mullenExpressiveT,mullenEarlyLearn,nGroup,nIndividual,waitingTime,cbcl0,cbcl4,cbcl12,levelLd,site,cluster,comply,covid,external0,external4,external12,ctrf0,ctrf4,ctrf12,ghq0,ghq4,ghq12,qrsf0,qrsf4,qrsf12,cpc0,cpc4,cpc12,psoc0,psoc4,psoc12,BL_P_PR,BL_P_COp,BL_P_COn,BL_P_Ip,BL_P_In,BL_P_SAp,BL_P_SAn,BL_P_Aff,BL_C_NC,BL_C_CP,BL_C_PN,BL_C_OP,BL_C_AV,BL_C_EA,FU1_P_PR,FU1_P_COp,FU1_P_COn,FU1_P_Ip,FU1_P_In,FU1_P_SAp,FU1_P_SAn,FU1_P_Aff,FU1_C_NC,FU1_C_CP,FU1_C_PN,FU1_C_OP,FU1_C_AV,FU1_C_EA,FU2_P_PR,FU2_P_COp,FU2_P_COn,FU2_P_Ip,FU2_P_In,FU2_P_SAp,FU2_P_SAn,FU2_P_Aff,FU2_C_NC,FU2_C_CP,FU2_C_PN,FU2_C_OP,FU2_C_AV,FU2_C_EA,nIntervals0,nIntervals4,nIntervals12,cn_total0,cn_total4,cn_total12
1,1,1,1,2,,,,,2,3.6358659,1,0,1,31,1,2,2,2,2,6,2,2,1,2,2,1,2,1,1,0,20,20,20,20,49,2,,62,97,95,95,1,1,1,0,0,34,34,28,66,56,38,10,20,12,11,15,10,11,30,40,83,61,78,6,9,0,19,0,2,0,15,7,7,0,0,6,17,8,8,0,28,0,3,0,16,19,28,0,0,2,8,8,9,0,25,0,5,0,14,7,1,0,0,19,11,40,40,40,42.5,75,25
2,0,1,1,2,,,,,2,3.6331279,0,0,1,31,2,1,2,1,1,2,1,2,1,2,2,2,2,1,1,0,,20,20,20,,,,,105,115,,1,1,77,0,0,35,41,,76,,,31,30,,20,22,,31,41,,58,49,,2,9,0,19,0,9,0,6,17,16,3,1,0,16,2,13,0,21,0,2,1,10,10,0,3,5,0,20,,,,,,,,,,,,,,,40,40,,60,50,
3,1,1,1,2,,,,,2,2.9705682,1,0,1,25,6,1,2,2,1,6,2,2,1,2,2,1,2,1,1,0,20,20,20,20,49,6,3,66,84,59,,1,1,1,1,0,26,23,,54,,,15,2,,11,8,,20,11,,82,89,,,,,,,,,,,,,,,,,,,,,,,,,,,,,,,,,,,,,,,,,,,,,,,,,
4,0,1,1,1,1,1,2,2,2,3.2005475,0,0,1,34,1,1,2,2,2,6,2,2,1,2,1,1,2,1,1,0,20,20,20,20,49,,,,108,128,129,1,1,143,0,0,34,45,44,74,75,38,19,21,13,13,16,,37,34,43,64,59,65,12,23,0,22,0,4,0,18,11,0,0,4,0,25,7,14,0,28,1,6,0,13,10,2,2,3,0,27,10,4,0,23,0,10,0,15,3,0,1,0,0,36,40,40,40,37.5,32.5,10
5,1,1,1,1,2,2,2,2,1,4.5174537,0,0,1,30,1,2,2,2,2,2,1,2,1,2,2,1,2,1,1,0,20,20,20,20,49,2,,62,125,129,118,1,1,1,0,0,47,44,46,,34,,7,8,7,13,12,11,35,47,32,81,95,74,3,2,0,24,0,4,0,5,21,7,0,1,0,18,7,3,0,23,0,6,0,9,12,0,0,0,1,27,2,7,1,29,0,4,0,5,14,2,0,0,19,3,40,40,40,55,30,45
6,0,1,1,1,2,2,2,2,1,4.7638602,0,0,1,28,1,1,2,2,2,3,1,2,1,2,2,2,2,1,1,0,36,25,20,20,56,,,,125,124,124,1,1,67,0,0,45,44,41,50,16,51,17,15,7,14,14,15,33,24,40,,77,79,1,13,2,25,0,3,0,4,17,12,2,1,5,15,7,15,1,27,0,7,0,11,13,1,0,1,13,14,7,2,0,23,0,11,0,8,5,3,0,1,23,7,40,40,40,50,32.5,25
7,1,1,1,2,,,,,1,4.8377824,0,0,1,28,1,2,2,2,2,2,1,2,1,2,2,2,2,1,1,0,20,21,23,20,50,,,,104,77,65,1,1,1,0,0,41,33,25,,,,9,12,7,12,11,12,34,39,25,88,91,71,1,7,0,16,0,12,0,11,9,0,1,0,30,0,2,17,1,22,1,4,0,12,13,5,2,0,14,9,1,2,0,11,0,17,0,12,6,2,2,2,20,1,40,40,40,25,42.5,47.5
8,0,1,1,2,,,,,1,4.6324434,0,0,1,33,6,2,2,2,1,2,1,2,1,2,2,2,2,1,2,0,20,20,29,34,57,,,,93,108,91,1,1,87,0,0,32,40,34,64,120,,8,9,18,15,14,13,26,32,32,87,76,68,0,1,0,12,0,14,0,3,6,1,0,0,21,8,1,0,0,18,0,12,0,1,3,2,0,0,22,14,10,2,0,22,0,11,0,12,0,0,0,0,26,6,40,40,40,27.5,10,20
9,0,1,2,1,1,2,2,2,2,4.9774127,0,0,1,23,1,2,2,2,2,2,1,2,1,2,2,1,2,2,1,0,24,41,35,36,70,,,,133,155,150,1,1,128,0,0,46,47,43,153,,,6,6,6,8,15,15,28,44,42,95,91,92,4,9,0,31,0,4,0,7,18,1,3,0,8,11,0,4,0,27,1,10,0,3,17,8,7,0,13,8,3,2,0,30,0,8,0,7,8,1,1,12,17,3,40,40,40,52.5,47.5,50
10,0,1,1,2,,,,,2,2.9103353,0,0,1,32,1,2,2,2,2,2,1,2,1,2,2,1,2,1,1,0,20,20,20,20,49,,,,137,133,143,1,1,104,0,0,46,45,46,121,,,29,24,11,15,18,14,46,46,41,78,75,73,5,22,0,23,0,10,0,14,17,29,16,1,0,5,13,19,0,26,0,4,0,25,9,1,1,0,0,31,13,6,0,23,0,6,0,14,5,2,4,1,1,9,40,40,40,87.5,22.5,75
11,1,1,2,1,1,1,2,1,1,3.5564682,0,0,1,36,2,2,2,2,1,6,1,2,1,2,2,2,2,1,1,0,20,20,35,33,59,3,3,53,101,85,91,1,1,2,0,0,31,26,24,31,30,94,14,14,13,16,13,17,36,43,34,68,67,90,10,6,0,22,0,8,0,11,2,2,0,0,21,16,11,7,0,37,0,3,0,14,9,12,1,0,27,1,12,6,0,27,0,5,0,16,1,2,2,0,31,6,40,40,40,7.5,30,7.5
12,0,1,1,1,2,2,2,2,1,4.3449693,0,0,1,29,6,1,2,2,2,3,1,2,1,2,2,1,2,1,1,0,20,20,20,20,49,,,,133,133,121,1,1,93,0,0,47,47,46,80,52,,18,13,14,16,14,16,16,46,41,70,72,74,6,7,0,32,0,6,0,7,15,2,0,1,10,14,14,9,0,33,0,4,0,16,17,11,2,0,14,9,4,3,0,29,2,7,0,14,7,3,0,1,28,2,40,40,40,40,42.5,25
13,1,1,2,1,2,2,2,2,2,3.778234,0,0,1,40,1,1,2,2,2,6,2,2,1,2,1,1,2,2,2,0,20,20,24,20,50,,,,102,91,103,1,1,2,0,0,41,39,44,9,,78,21,3,14,21,17,21,40,37,35,68,80,60,4,2,0,38,0,1,0,4,21,1,0,1,4,14,19,0,0,36,0,3,0,20,6,0,0,0,7,27,10,3,0,28,0,3,0,11,7,2,1,3,22,7,40,40,40,55,15,27.5
14,1,1,1,1,2,2,2,1,1,4.3641343,0,0,1,27,1,2,2,2,2,5,2,2,1,1,2,1,2,1,1,0,,,,,,,,,96,110,114,1,1,2,0,0,30,33,36,,45,,13,19,20,22,20,21,39,38,46,68,68,60,1,6,0,22,0,9,0,3,11,8,7,6,0,19,3,5,0,29,0,1,0,4,14,7,0,0,0,21,5,6,0,17,0,10,0,5,4,5,0,0,0,32,40,40,40,52.5,47.5,20
15,0,1,1,2,,,,,2,3.9260781,0,0,1,38,6,2,2,2,1,2,1,2,1,2,2,2,2,1,1,0,20,20,20,22,49,,,,58,70,48,1,1,146,0,0,30,28,23,30,,,9,13,10,11,12,14,26,27,33,66,74,57,5,8,0,32,0,2,0,5,15,9,5,0,0,25,8,9,0,26,0,11,0,8,0,0,0,0,16,24,5,2,0,25,0,6,0,5,1,1,0,0,23,8,40,40,40,37.5,0,22.5
16,1,1,1,2,,,,,2,3.0691307,0,0,1,36,2,1,2,2,2,2,1,2,1,2,2,1,2,1,1,0,,20,20,20,,6,3,54,69,77,60,1,1,2,1,0,26,34,30,,50,,7,6,6,13,16,16,42,39,34,87,83,89,4,12,0,18,0,9,0,15,10,7,4,0,0,27,7,9,0,29,0,3,1,15,22,7,0,0,0,17,9,23,0,20,0,6,0,26,10,6,0,0,0,27,40,40,40,32.5,57.5,32.5
17,1,1,2,1,1,1,2,1,2,4.0848732,0,0,1,24,6,2,2,2,1,2,1,2,1,2,2,2,2,1,1,0,20,20,23,20,49,5,2,33,117,136,129,1,1,2,1,0,39,37,40,67,96,,19,18,20,,25,24,46,41,41,74,71,66,6,8,0,33,0,2,0,9,15,16,0,0,8,13,,,,,,,,,,,,,,,,,,,,,,,,,,,,,40,,,47.5,,
18,1,1,1,2,,,,,2,4.3504448,0,0,1,27,1,2,2,2,2,6,2,2,1,2,1,1,2,1,1,0,20,20,23,20,50,6,2,0,115,117,121,1,1,2,1,0,39,37,40,,109,54,19,14,11,11,14,14,30,32,34,56,54,61,2,3,0,27,3,8,0,2,10,6,1,0,21,9,1,1,5,25,2,8,0,3,12,13,2,1,10,12,1,0,0,26,0,8,0,1,2,2,0,0,28,9,40,40,40,25,45,7.5
19,1,1,2,1,2,1,2,2,2,3.1293635,0,0,1,33,1,1,2,2,2,3,1,2,1,2,2,1,2,1,1,0,29,20,20,20,52,,,,118,,,1,1,3,0,0,46,,,,,,10,,,17,,,36,,,83,,,21,2,0,35,0,4,0,21,15,16,4,0,12,9,,,,,,,,,,,,,,,,,,,,,,,,,,,,,40,,,47.5,,
20,1,1,2,1,2,2,2,1,2,4.2683096,0,0,1,27,1,2,2,2,2,2,1,2,1,2,2,1,2,1,1,0,,,,,,3,,84,121,127,131,1,1,3,0,0,46,41,42,,144,16,22,12,14,20,15,12,32,31,32,44,55,56,1,13,0,32,0,6,0,1,17,7,1,0,8,11,1,8,0,29,0,9,0,10,5,5,1,0,11,31,0,10,0,19,0,19,0,1,20,16,4,0,14,5,40,40,40,52.5,0,52.5
21,0,1,2,1,2,1,2,2,2,3.4031484,0,0,1,34,6,1,2,2,2,6,2,2,1,2,2,1,2,1,1,0,20,20,20,20,49,,,,126,133,,1,1,135,0,0,46,47,,,,,16,18,,13,20,,45,49,,52,63,,7,17,0,19,0,17,0,9,10,9,1,0,1,27,,,,,,,,,,,,,,,,,,,,,,,,,,,,,40,,,30,,
22,1,1,1,2,,,,,1,4.1204653,0,0,1,36,1,2,2,2,2,6,2,2,1,2,1,1,2,1,1,0,20,20,,35,,6,3,42,91,96,106,1,1,3,1,0,39,38,37,85,,113,14,15,16,15,17,16,27,39,38,81,67,69,4,1,0,25,0,6,0,4,9,0,0,0,12,19,1,0,0,29,0,2,0,2,22,2,1,0,8,10,,,,,,,,,,,,,,,40,40,,22.5,55,
23,1,1,2,2,,,,,2,3.7152636,1,0,2,36,2,2,1,2,2,2,1,2,1,2,2,1,2,1,1,0,23,20,20,24,51,,,,97,88,102,1,1,3,0,0,38,37,34,,71,25,14,8,11,16,17,14,22,25,22,70,63,57,0,2,0,16,0,8,0,0,23,40,0,0,0,0,5,0,0,21,0,11,0,6,1,0,0,0,14,15,4,1,0,19,0,11,0,6,4,0,1,0,28,8,40,40,40,100,27.5,10
24,1,1,1,2,,,,,2,3.5099247,0,0,1,26,2,2,2,2,2,6,1,2,1,2,2,2,2,2,1,0,20,20,20,20,49,2,,,133,,,1,1,3,0,0,45,,,105,,,23,,,20,,,38,,,58,,,11,13,0,34,0,4,0,11,9,0,0,4,0,27,,,,,,,,,,,,,,,,,,,,,,,,,,,,,40,,,32.5,,
25,0,1,2,2,,,,,2,3.211499,0,0,1,29,1,2,2,2,2,6,2,2,1,2,1,1,2,1,2,0,25,20,27,45,62,,,,73,97,113,1,1,69,0,0,36,41,43,95,93,,9,11,29,16,,21,33,44,37,61,66,59,6,8,0,27,1,2,0,6,17,6,5,0,13,10,5,6,0,25,1,3,0,12,14,9,5,0,12,11,4,18,0,33,0,2,0,5,23,16,2,0,14,1,40,40,40,42.5,42.5,62.5
26,1,1,2,1,2,1,2,2,2,3.2087612,1,0,1,33,1,2,2,2,2,6,2,2,1,2,2,1,2,1,1,0,,20,,24,,,,,109,107,105,1,1,3,0,0,40,45,43,50,62,71,11,10,9,18,19,19,30,46,32,59,,71,1,3,0,33,0,6,0,2,18,0,1,0,20,2,,,,,,,,,,,,,,,6,3,0,23,0,14,0,7,4,4,1,1,24,10,40,,40,45,,15
27,1,1,1,2,,,,,1,3.5947981,0,0,1,23,6,2,2,2,2,6,2,2,1,2,1,1,2,1,1,0,20,20,20,20,49,6,2,42,124,112,106,1,1,3,1,0,41,37,33,37,,,13,11,14,16,20,12,40,33,35,62,71,71,7,14,0,26,0,10,0,10,12,3,0,0,7,21,8,6,0,26,0,12,0,11,7,10,2,0,0,30,6,11,0,32,0,7,0,7,10,2,1,0,1,28,40,40,40,30,25,27.5
28,0,1,2,1,2,1,2,2,2,2.5626283,0,0,1,26,6,1,2,2,2,6,2,2,1,2,2,1,2,1,1,0,23,37,20,22,56,,,,116,113,123,1,1,125,0,0,46,39,45,90,,,17,9,12,16,18,20,41,36,41,53,65,43,10,3,0,25,0,5,0,12,5,0,1,1,1,33,7,2,0,22,0,13,0,7,0,0,0,0,23,17,4,9,0,32,0,3,0,6,15,13,5,1,16,5,40,40,40,15,0,47.5
29,1,1,2,1,1,2,2,2,2,4.9883642,0,0,1,25,6,1,2,2,2,3,1,2,1,2,2,2,2,2,1,0,47,43,23,26,71,5,,37,95,112,110,1,1,3,0,0,34,39,35,70,100,62,14,9,21,15,24,13,35,42,31,83,78,58,8,5,0,23,0,5,0,11,0,0,0,0,28,12,12,2,0,28,0,4,0,12,0,0,0,0,33,7,0,6,0,19,0,10,0,6,2,0,0,0,26,12,40,40,40,0,0,5
30,0,1,2,1,1,2,2,2,2,2.9733059,0,0,1,39,1,1,2,2,2,6,2,1,1,2,1,1,2,1,1,0,20,20,20,23,50,,,,108,137,137,1,1,149,0,0,44,45,43,,,,26,20,,25,28,,49,47,39,59,67,,,,,,,,,,,,,,,,,,,,,,,,,,,,,,,,,,,,,,,,,,,,,,,,,
31,0,1,2,2,,,,,2,4.019165,0,0,1,29,6,1,2,2,3,2,1,2,1,2,2,2,2,1,1,0,,,,,,,,,104,120,113,1,1,109,0,0,39,43,42,122,102,47,14,21,16,18,17,14,24,36,27,60,66,83,13,2,0,31,0,8,0,17,12,0,0,1,14,13,9,2,0,28,0,10,0,12,2,0,0,0,22,16,7,1,0,30,0,8,0,8,9,0,0,0,24,7,40,40,40,32.5,5,22.5
32,0,1,2,1,2,1,2,2,2,3.3867214,0,0,2,38,2,1,2,2,2,6,2,2,1,2,1,1,2,1,1,0,37,20,29,38,61,,,,88,86,84,1,1,129,0,0,41,37,38,8,,,11,8,12,16,,10,24,23,23,49,56,53,8,0,0,26,0,6,0,11,0,0,0,0,30,6,7,3,0,29,0,1,0,8,0,0,0,0,15,15,4,2,0,27,0,3,0,6,0,0,0,0,29,11,36,40,40,0,25,0
33,1,1,2,1,1,1,2,1,2,3.8329911,0,0,1,32,1,1,2,2,3,2,1,2,1,2,1,2,2,1,1,0,20,20,20,26,51,,,,112,106,103,1,1,4,0,0,46,35,37,,,,9,9,8,12,15,14,25,31,24,65,70,74,3,5,0,25,0,11,0,6,8,1,0,0,28,4,1,5,0,22,0,12,0,8,4,0,0,0,36,0,,,,,,,,,,,,,,,40,40,,20,10,
34,0,1,2,1,2,2,2,2,2,3.5071869,0,0,1,24,6,1,2,2,2,6,2,2,1,2,2,1,2,1,1,0,27,20,20,31,55,,,,117,115,,1,1,115,0,0,42,38,,,76,,12,13,,9,7,,47,44,,66,74,,9,6,0,31,0,1,0,11,20,2,0,2,4,14,7,1,0,20,0,8,0,8,9,2,0,1,16,4,,,,,,,,,,,,,,,40,39,,55,48.717949,
35,1,1,2,1,2,1,2,2,2,3.1731691,0,0,1,25,6,1,2,2,2,6,2,2,1,2,2,1,2,1,1,0,20,20,20,20,49,4,2,111,154,132,116,1,1,4,1,0,47,46,36,,,54,16,14,12,16,16,14,49,45,38,62,61,69,15,2,0,24,0,7,0,17,8,0,0,0,10,22,9,2,0,28,0,4,0,10,16,0,0,0,5,19,9,13,0,26,0,4,0,11,8,0,0,0,9,23,40,40,40,20,40,20
36,1,1,2,1,2,1,2,2,2,4.3039017,0,0,1,25,6,2,2,2,2,6,2,2,1,2,1,1,2,1,1,0,20,26,31,40,62,4,,49,103,94,120,1,1,5,0,0,47,41,46,95,18,97,13,8,17,18,11,16,42,29,30,69,80,76,,,,,,,,,,,,,,,,,,,,,,,,,,,,,,,,,,,,,,,,,,,,,,,,
37,1,1,1,1,2,2,2,1,2,3.5373032,0,3,1,43,2,2,2,2,2,6,2,1,2,2,,,,,,4,20,20,20,20,49,6,3,83,79,99,103,1,1,4,1,0,27,29,32,34,,,4,6,23,,17,21,35,36,33,,78,69,5,8,0,27,0,5,0,8,20,1,0,1,0,19,12,25,2,23,2,1,0,14,16,10,0,0,0,24,,,,,,,,,,,,,,,40,40,,52.5,40,
38,0,1,2,2,,,,,2,4.1697469,1,0,1,28,1,2,2,2,3,2,1,2,1,1,2,2,2,1,1,0,37,,,,,,,,105,93,111,1,1,132,0,0,42,35,40,116,39,11,15,16,17,11,15,19,29,40,29,62,67,66,,,,,,,,,,,,,,,,,,,,,,,,,,,,,,,,,,,,,,,,,,,,,,,,
39,1,1,1,1,1,2,2,2,2,3.1813827,0,1,2,44,2,2,2,2,2,6,2,2,1,2,2,1,1,1,2,1,20,20,20,20,49,,,,98,146,115,1,1,4,0,0,23,40,30,,,66,18,16,13,12,22,,25,43,45,59,60,73,4,5,0,25,0,14,0,8,10,1,0,0,0,30,4,12,0,27,0,3,0,6,22,8,0,0,0,17,,,,,,,,,,,,,,,40,40,,25,57.5,
40,1,1,2,1,2,1,2,1,2,4.3203287,0,0,1,31,6,1,2,1,2,2,1,1,1,2,2,2,2,1,1,0,34,20,47,43,73,,,,125,133,125,1,1,5,0,0,41,41,39,72,60,31,11,13,10,,15,13,27,37,42,,67,,,,,,,,,,,,,,,,3,1,0,26,0,6,0,9,2,0,0,0,31,7,3,4,0,18,0,7,0,4,1,0,0,0,27,9,,40,37,,5,2.7027028
41,1,1,1,2,,,,,1,4.1724844,0,0,1,22,6,2,2,2,2,6,1,2,1,2,2,2,2,1,1,0,20,20,20,20,49,,,,85,59,52,1,1,4,0,0,25,19,17,38,36,38,7,4,,13,9,10,34,28,17,89,81,90,,,,,,,,,,,,,,,,,,,,,,,,,,,,,,,,,,,,,,,,,,,,,,,,
42,0,1,2,2,,,,,2,4.013689,0,0,1,32,6,2,2,2,1,6,2,1,2,2,,,,,,0,50,45,51,47,96,,,,54,53,48,1,1,126,0,0,19,20,13,42,28,39,11,8,10,7,10,,17,21,18,76,77,88,6,7,0,29,0,3,0,7,10,4,1,0,15,14,9,0,0,23,0,9,0,10,2,1,0,0,19,19,8,0,0,26,0,10,0,10,2,0,0,0,24,14,40,40,40,27.5,5,5
43,1,1,2,2,,,,,2,2.5571527,0,0,1,28,1,2,2,2,2,2,1,2,1,2,2,1,2,1,1,0,20,20,20,20,49,1,,13,116,104,110,1,1,4,0,0,39,32,36,,89,,17,14,18,12,11,15,36,31,,64,63,68,,,,,,,,,,,,,,,,,,,,,,,,,,,,,,,,,,,,,,,,,,,,,,,,
44,1,1,2,2,,,,,2,4.1670089,0,0,1,34,4,1,2,2,1,2,1,2,1,2,2,2,2,1,1,0,20,20,23,34,55,5,2,,40,29,17,1,1,4,1,0,16,9,4,,53,53,10,9,9,13,14,11,20,24,24,73,80,91,4,2,0,21,0,8,0,11,11,5,5,0,19,0,10,3,0,27,0,4,0,13,1,0,0,0,29,10,,,,,,,,,,,,,,,40,40,,52.5,2.5,
45,1,1,1,1,2,1,2,2,2,3.8795345,0,0,1,27,1,1,2,2,2,6,2,1,1,2,1,1,2,1,1,0,20,20,32,30,56,,,,152,160,158,1,1,5,0,0,44,47,44,160,,,22,12,21,14,14,17,44,43,46,64,66,60,2,0,0,28,0,8,0,8,13,8,3,0,17,9,3,2,0,24,0,6,0,7,5,5,1,1,21,13,8,0,0,27,0,6,0,9,7,11,1,0,19,4,40,40,40,35,15,42.5
46,1,1,1,2,,,,,1,4.8542094,0,0,1,24,6,2,2,2,2,6,2,1,1,2,2,2,2,1,1,0,20,20,20,20,49,6,3,80,71,61,55,1,1,5,1,0,24,24,20,68,53,57,7,6,7,15,15,13,33,38,19,76,82,88,2,2,0,28,0,3,0,3,16,7,4,2,8,14,7,12,0,26,0,11,0,11,11,13,3,0,14,11,0,11,0,28,0,9,0,1,13,7,0,0,21,5,40,40,40,45,37.5,35
47,1,1,2,2,,,,,2,4.1642709,0,0,1,24,4,2,2,2,2,2,1,2,1,2,2,2,2,2,1,0,32,51,36,41,81,2,1,,97,120,122,1,1,5,0,0,38,44,44,86,73,63,24,22,28,17,18,18,35,34,38,57,45,50,,,,,,,,,,,,,,,,,,,,,,,,,,,,,,,,,,,,,,,,,,,,,,,,
48,0,1,2,2,,,,,2,3.4168377,0,0,2,36,2,2,2,2,1,3,1,2,2,2,,,,,,0,21,20,29,29,55,,,,45,38,29,1,1,141,0,0,20,18,12,36,14,,18,2,6,11,9,9,17,24,17,92,95,96,3,1,0,26,0,6,0,3,8,3,0,0,11,21,3,2,0,26,0,2,0,6,4,1,0,0,12,23,,,,,,,,,,,,,,,40,40,,20,12.5,
49,0,1,2,1,2,2,2,2,2,3.0718687,1,0,1,32,6,2,2,2,2,2,1,1,1,2,2,2,2,2,1,0,45,35,46,31,79,,,,86,106,,1,1,101,0,0,37,46,,31,,,14,14,,16,15,,37,29,,66,63,,4,2,0,23,0,9,0,6,9,1,0,1,13,16,9,0,0,23,0,8,0,13,5,1,0,0,25,10,,,,,,,,,,,,,,,40,40,,27.5,12.5,
50,0,1,1,2,,,,,1,4.6132784,0,0,1,41,2,2,2,2,1,2,1,1,2,2,,,,,,0,23,37,34,43,70,,,,39,40,46,1,1,153,0,0,19,18,18,69,36,,11,7,13,15,15,16,25,19,24,71,71,61,4,8,0,30,0,4,0,6,12,0,0,0,27,1,8,1,0,28,0,4,0,13,0,0,0,0,26,14,,,,,,,,,,,,,,,40,40,,30,0,
51,0,1,2,1,1,2,2,2,2,2.9650924,0,0,1,22,6,2,2,2,2,6,2,1,1,2,1,1,2,1,1,0,38,31,35,40,73,,,,103,69,,1,1,108,0,0,40,31,,,,,11,7,,14,14,,35,24,,67,71,,,,,,,,,,,,,,,,,,,,,,,,,,,,,,,,,,,,,,,,,,,,,,,,,
52,1,1,2,2,,,,,2,3.6221766,0,0,1,46,6,2,2,2,1,2,1,2,1,2,2,2,2,1,1,0,20,20,36,34,59,6,3,50,44,37,41,1,1,6,1,0,11,10,9,75,,,13,12,10,11,14,,26,27,28,72,68,75,,,,,,,,,,,,,,,,,,,,,,,,,,,,,,,,,,,,,,,,,,,,,,,,
53,1,1,2,1,1,2,2,2,2,2.5900068,1,0,1,36,6,2,2,2,2,6,2,1,1,2,2,2,2,2,1,0,58,42,49,30,90,5,3,57,83,69,56,1,1,6,1,0,28,22,21,98,63,,16,7,11,14,10,14,30,24,18,,,,,,,,,,,,,,,,,,,,,,,,,,,,,,,,,,,,,,,,,,,,,,,,,,,
54,0,1,1,1,1,2,2,2,2,2.5462012,0,0,1,35,6,2,2,2,1,6,2,1,1,2,2,2,2,2,1,0,27,20,20,22,52,,,,123,,117,1,1,98,0,0,39,,32,97,,,16,,17,13,,18,35,,38,69,,64,,,,,,,,,,,,,,,,,,,,,,,,,,,,,,,,,,,,,,,,,,,,,,,,
55,0,1,1,1,2,1,2,2,2,3.7344284,0,0,1,35,1,1,2,2,2,6,2,2,1,2,1,1,2,1,1,0,20,20,20,20,49,,,,67,86,94,1,1,144,0,0,21,31,35,79,43,,8,5,10,14,13,8,26,37,31,66,90,71,,,,,,,,,,,,,,,,,,,,,,,,,,,,,,,,,,,,,,,,,,,,,,,,
56,1,1,1,1,2,1,2,1,1,3.6468172,0,0,1,38,1,1,2,2,2,6,2,2,1,2,1,1,2,1,1,0,20,20,20,20,49,1,,31,143,146,,1,1,6,0,0,43,39,,,55,,5,11,,12,13,,42,46,,,62,,9,21,0,22,0,2,0,16,12,0,0,2,0,26,11,9,0,22,0,3,0,14,13,0,0,1,0,26,,,,,,,,,,,,,,,40,40,,35,35,
57,0,1,1,1,2,2,2,2,2,2.9623547,0,0,1,22,6,2,2,2,2,3,1,2,1,2,2,2,2,2,1,0,35,21,30,45,68,,,,42,37,38,1,1,114,0,0,14,14,16,67,,,10,17,11,11,15,10,16,14,28,73,70,65,9,9,0,34,0,0,0,11,16,6,2,0,11,12,7,0,0,22,0,1,0,12,0,0,0,0,22,12,,,,,,,,,,,,,,,40,34,,42.5,0,
58,0,1,2,2,,,,,2,2.9349761,0,0,1,28,6,2,2,2,2,6,2,2,1,2,1,2,2,1,1,0,24,20,20,20,50,,,,125,105,119,1,1,118,0,0,40,37,41,,107,,16,13,14,17,16,18,40,,26,64,80,70,1,1,0,25,1,15,0,3,11,1,0,1,0,28,5,0,0,20,0,13,0,6,5,4,0,0,0,33,,,,,,,,,,,,,,,40,40,,30,17.5,
59,1,1,1,2,,,,,1,3.4743326,0,0,1,35,6,1,2,2,2,2,1,1,1,2,2,2,2,1,1,0,43,20,43,20,66,6,2,20,112,87,114,1,1,6,1,0,39,29,33,53,65,,22,18,15,14,13,18,27,39,22,67,69,67,5,4,0,22,0,6,0,7,9,2,1,0,14,17,9,1,0,27,0,3,0,9,8,1,0,0,18,14,,,,,,,,,,,,,,,40,40,,22.5,20,
60,1,1,1,1,2,1,2,2,2,4.3422313,0,0,1,39,2,2,2,2,1,7,1,2,2,2,,,,,,0,45,43,36,28,77,5,2,9,76,86,72,1,1,6,1,0,30,35,30,,,,12,15,21,19,18,18,28,23,23,54,59,60,7,4,0,28,0,9,0,11,4,0,0,0,19,17,11,2,0,25,0,2,0,12,2,0,0,1,27,10,,,,,,,,,,,,,,,40,40,,10,7.5,
61,1,1,1,1,2,1,2,2,2,2.6119096,1,0,1,37,2,1,2,2,1,2,1,2,2,2,,,,,,0,22,32,20,20,54,6,3,1,79,91,113,1,1,6,1,0,28,30,31,89,77,,23,19,,17,16,,46,37,,75,,,6,4,0,25,0,0,0,8,7,6,0,0,0,33,,,,,,,,,,,,,,,,,,,,,,,,,,,,,40,,,17.5,,
62,1,1,1,2,,,,,2,3.6221766,1,0,1,32,2,2,2,2,2,6,2,1,1,2,2,2,2,1,1,0,20,20,20,20,49,,,,92,107,111,1,1,6,0,0,39,40,43,86,98,,14,5,12,16,18,18,33,29,33,66,87,74,,,,,,,,,,,,,,,,,,,,,,,,,,,,,,,,,,,,,,,,,,,,,,,,
63,1,1,1,2,,,,,2,3.6605065,0,0,1,29,1,2,2,1,1,2,1,2,1,2,2,2,2,1,1,0,25,34,36,27,64,6,2,9,92,94,90,1,1,6,1,0,33,31,32,79,,,21,12,18,21,20,20,41,45,36,59,58,61,,,,,,,,,,,,,,,,,,,,,,,,,,,,,,,,,,,,,,,,,,,,,,,,
64,1,1,2,1,1,1,1,1,2,2.5544147,1,0,1,34,1,2,2,2,2,6,2,2,1,2,2,2,2,1,1,0,27,40,46,38,77,5,3,1,112,100,124,1,1,6,1,0,32,26,33,18,30,,19,12,15,15,14,11,34,28,31,63,78,71,,,,,,,,,,,,,,,,,,,,,,,,,,,,,,,,,,,,,,,,,,,,,,,,
65,0,1,1,1,1,2,2,2,1,4.8377824,1,0,1,41,6,2,2,2,1,1,1,2,1,2,2,2,2,2,1,0,20,20,33,20,53,,,,,52,80,1,2,103,0,0,,19,21,,65,48,13,19,17,,,18,34,33,25,51,59,71,7,3,0,28,0,4,0,7,3,0,0,0,19,16,6,17,0,36,0,1,0,17,4,3,0,1,12,22,11,18,0,36,3,0,0,16,7,2,0,0,13,19,40,40,40,12.5,15,20
66,1,1,1,2,,,,,1,4.9938397,0,3,1,43,3,1,2,2,2,6,2,2,1,2,1,1,2,1,1,4,,,,,,3,2,80,81,50,29,1,2,15,0,0,28,16,10,77,50,81,9,3,8,23,7,13,28,18,10,54,81,82,0,4,3,19,5,6,0,0,20,16,2,6,2,1,1,21,0,25,0,1,0,2,17,2,0,0,12,11,3,3,3,22,0,9,0,3,13,0,12,10,1,11,40,40,40,92.5,42.5,70
67,0,2,1,2,,,,,1,2.7980835,0,4,1,25,1,2,2,2,2,6,2,2,1,2,1,2,2,2,1,5,20,20,20,20,49,,,,74,95,,2,2,111,0,0,25,29,,,58,,25,14,,20,20,,,41,,85,54,,,,,,,,,,,,,,,,,,,,,,,,,,,,,,,,,,,,,,,,,,,,,,,,,
68,1,1,1,1,1,1,2,2,1,3.5537302,0,0,1,34,1,2,2,2,2,6,2,2,1,2,1,1,2,1,1,0,20,20,30,36,58,,,,124,,121,1,2,15,0,0,46,,45,,,,9,,9,,,10,33,,49,77,,68,9,1,0,20,0,13,0,9,0,0,0,0,36,0,,,,,,,,,,,,,,,,,,,,,,,,,,,,,40,,,10,,
69,1,1,1,1,2,2,2,2,2,3.2936344,0,0,1,33,1,1,1,2,2,1,2,2,1,2,1,1,2,1,1,0,20,20,20,20,49,,,,62,,136,1,2,15,0,0,15,,43,,,,17,,,17,,,12,,,93,,,,,,,,,,,,,,,,,,,,,,,,,,,,,,,,,,,,,,,,,,,,,,,,,,
70,1,2,1,2,,,,,1,4.9363451,0,4,1,43,2,1,2,2,2,6,2,1,1,2,2,2,2,1,1,5,,,,,,1,,20,115,,,2,2,16,0,0,38,,,,,,20,,,11,,,33,,,57,,,2,7,0,6,0,6,0,4,2,6,1,0,0,11,,,,,,,,,,,,,,,,,,,,,,,,,,,,,34,,,67.647057,,
71,0,1,2,1,2,2,1,1,2,3.6796715,1,2,1,36,2,2,2,2,2,2,1,2,1,2,2,1,2,1,1,3,33,49,27,27,70,,,,104,122,139,1,2,117,0,0,44,37,40,,,,,11,6,,21,16,49,46,49,,,82,,,,,,,,,,,,,,,,,,,,,,,,,,,,,,,,,,,,,,,,,,,,,,,,
72,0,1,1,1,2,1,2,2,1,4.657084,0,0,1,37,2,2,2,2,1,6,1,2,1,2,2,2,2,2,1,5,20,20,20,20,49,,,,104,146,122,1,2,91,0,0,40,46,42,53,,37,22,25,24,17,17,19,40,42,37,55,66,60,2,12,0,16,0,11,0,3,17,12,14,1,3,8,8,3,0,29,0,8,0,10,14,3,8,0,10,10,2,5,0,21,0,10,0,8,3,0,0,0,27,10,40,40,40,72.5,50,7.5
73,0,1,1,2,,,,,2,4.1286788,1,1,1,41,2,2,2,2,1,7,1,2,2,2,,,,,,4,28,26,22,30,51,,,,83,62,41,1,2,61,0,0,24,11,10,,43,39,20,8,8,19,14,12,33,29,17,50,85,92,5,11,0,23,1,11,0,16,8,6,0,0,23,4,11,3,0,22,0,9,0,13,9,4,0,0,10,19,0,10,2,29,0,6,0,6,12,1,3,4,13,10,40,40,40,32.5,27.5,42.5
74,1,1,2,2,,,,,2,3.0198493,1,0,1,44,6,2,2,2,2,6,2,1,1,2,2,1,2,1,2,0,,,,,,5,3,12,75,49,62,1,2,19,1,0,31,20,27,28,61,,21,3,9,16,9,14,27,22,28,62,79,70,6,6,0,22,0,8,0,9,11,1,3,4,0,24,17,3,0,24,0,6,0,21,9,1,1,1,2,27,,,,,,,,,,,,,,,40,40,,40,27.5,
75,1,1,1,1,2,2,2,2,2,4.4982886,0,0,1,41,2,2,2,2,2,2,1,1,2,2,,,,,,0,45,20,32,42,71,6,3,40,83,57,81,1,2,16,1,0,34,21,30,40,59,,12,18,14,15,16,18,30,25,21,,82,76,9,10,0,16,0,4,0,9,3,0,0,0,28,9,19,10,0,25,0,4,0,19,0,0,0,0,21,17,15,7,0,24,0,0,0,17,0,0,1,1,21,17,40,40,40,7.5,5,5
76,1,1,1,1,1,2,2,2,1,4.2573581,1,1,1,35,6,2,2,2,2,2,2,1,1,2,2,2,2,2,1,0,,,,,,,,,76,,,1,2,54,0,0,30,,,,,,14,,,9,,,29,,,77,,,,,,,,,,,,,,,,,,,,,,,,,,,,,,,,,,,,,,,,,,,,,,,,,,
77,0,1,2,2,,,,,2,2.8473649,0,3,1,25,6,2,2,2,3,6,1,2,1,2,2,2,2,1,1,4,17,16,16,13,49,,,,35,37,39,1,2,123,0,0,6,9,12,,77,,6,4,3,9,11,8,19,19,19,85,94,101,8,24,0,30,0,0,0,8,14,1,0,5,0,20,6,27,0,28,0,0,0,9,14,3,8,0,0,24,13,15,0,31,0,1,0,18,3,0,0,0,0,37,40,40,40,50,40,7.5
78,1,1,2,1,2,2,2,1,2,3.1622176,0,2,2,38,2,2,2,2,1,3,1,2,2,2,,,,,,3,,,,,,,,,57,63,73,1,2,50,0,0,14,21,28,45,,,6,10,17,8,21,21,34,33,35,96,57,61,1,1,0,28,0,3,0,1,19,2,0,1,0,20,0,4,0,30,0,4,0,0,20,0,0,1,0,19,0,2,0,28,0,1,0,3,16,1,0,3,0,19,40,40,40,50,52.5,52.5
79,0,2,1,1,2,2,1,2,1,3.0910335,0,4,1,41,2,2,2,2,1,3,1,2,2,2,,,,,,5,,,,,,,,,69,37,76,2,2,100,0,0,26,15,26,,50,60,18,10,12,16,15,22,36,35,42,60,60,65,1,13,0,21,0,8,0,7,13,2,0,2,4,19,10,25,0,29,0,0,0,13,18,1,0,0,6,14,6,25,0,22,0,4,0,21,16,7,3,8,0,15,40,40,40,42.5,50,62.5
80,1,1,2,2,,,,,2,3.9616702,0,2,1,34,2,2,2,2,3,6,1,2,1,2,2,2,2,2,1,3,23,18,7,11,49,6,3,73,94,83,100,1,2,21,1,0,28,22,31,59,,,22,3,6,19,11,16,43,46,38,100,81,78,5,15,0,25,0,2,0,9,5,0,3,8,0,25,10,25,0,29,0,0,0,11,14,0,0,0,0,26,2,12,0,24,0,5,0,2,11,0,0,3,0,25,40,40,40,37.5,35,37.5
81,0,1,1,2,,,,,2,3.2908967,0,4,1,45,1,1,2,2,2,6,2,2,1,2,1,1,2,1,1,1,24,17,13,9,49,,,,100,,92,1,2,86,0,0,30,,32,102,,,20,,6,10,,13,38,,31,71,,72,8,21,0,29,0,2,0,10,13,10,0,0,0,25,,,,,,,,,,,,,,,,,,,,,,,,,,,,,40,,,37.5,,
82,1,1,1,2,,,,,2,3.3155372,0,3,1,37,4,2,2,2,2,6,2,1,1,2,1,1,2,1,1,4,20,20,20,24,50,4,1,39,78,75,,1,2,22,0,0,23,24,,60,,,15,,,19,,,29,,,81,,,10,14,0,28,0,0,0,19,2,3,0,0,3,33,4,19,0,28,0,3,0,11,1,0,0,0,7,32,,,,,,,,,,,,,,,40,40,,10,2.5,
83,0,1,1,2,,,,,2,3.7316906,1,3,2,34,2,2,2,2,2,3,1,2,1,2,2,1,2,2,2,4,20,20,20,20,49,,,,90,,,1,2,95,0,0,33,,,91,,,13,,,16,,,48,,,72,,,4,16,0,33,5,0,0,14,15,5,1,0,5,19,,,,,,,,,,,,,,,,,,,,,,,,,,,,,40,,,40,,
84,0,1,1,1,2,2,2,1,1,4.6735115,1,3,1,42,1,2,2,2,2,6,2,2,1,2,1,1,2,1,2,4,29,42,26,35,68,,,,89,95,85,1,2,79,0,0,31,32,35,,74,,12,10,13,18,25,24,25,31,35,72,67,80,4,8,0,15,0,12,0,7,1,0,0,0,4,35,4,9,0,23,0,6,0,11,0,0,0,0,10,30,,,,,,,,,,,,,,,40,40,,2.5,0,
85,0,1,2,1,1,1,2,2,1,4.1560574,1,0,1,36,2,2,2,2,1,2,1,2,1,2,2,2,2,2,1,0,32,20,20,20,53,,,,56,43,59,1,2,66,0,0,19,18,22,83,13,,10,4,9,15,15,14,22,21,18,70,64,72,10,5,0,29,0,4,0,10,0,0,0,0,3,37,6,0,0,22,0,11,0,6,1,0,0,0,2,37,,,,,,,,,,,,,,,40,40,,0,2.5,
86,1,1,2,1,1,2,2,2,2,2.5790555,0,1,1,33,3,1,2,2,2,2,1,2,1,2,2,2,2,1,1,4,20,20,20,24,50,,,,103,114,139,1,2,26,0,0,34,39,41,,,,24,20,19,14,12,9,34,36,41,73,69,69,0,32,0,23,1,1,0,5,7,5,1,2,0,30,4,10,2,28,0,5,0,10,4,3,0,5,8,20,,,,,,,,,,,,,,,40,40,,25,30,
87,1,1,2,1,2,2,2,1,2,3.4770706,0,2,1,31,2,2,2,2,2,6,1,2,1,2,2,1,2,1,1,3,35,20,20,20,54,6,3,126,125,69,58,1,2,23,1,0,42,25,18,37,27,,6,3,9,9,9,9,44,33,20,82,82,65,6,7,0,31,0,5,0,9,18,5,2,2,4,16,10,4,0,30,0,9,0,10,1,0,0,0,17,22,,,,,,,,,,,,,,,40,40,,50,2.5,
88,1,1,1,1,2,2,2,2,1,4.019165,0,0,1,38,2,1,2,2,2,6,2,2,1,2,2,2,2,2,1,0,20,20,20,20,49,,,,96,,,1,2,30,0,0,29,,,,,,21,,,13,,,33,,,76,,,8,11,0,27,0,3,0,8,2,4,0,0,6,30,,,,,,,,,,,,,,,,,,,,,,,,,,,,,40,,,10,,
89,1,1,2,1,2,2,1,2,2,3.3894594,0,1,1,42,2,2,2,2,1,6,1,2,1,2,2,2,2,1,1,1,20,20,20,20,49,5,3,46,96,87,80,1,2,23,1,0,30,20,28,42,44,,16,25,26,22,26,21,43,33,36,71,65,76,4,7,0,12,0,23,0,7,7,0,0,3,0,30,5,15,0,26,0,4,0,12,13,0,3,0,0,27,,,,,,,,,,,,,,,40,40,,25,32.5,
90,1,1,2,2,,,,,2,3.1266255,0,2,1,34,3,2,2,2,2,6,2,2,1,2,1,1,2,1,1,4,20,20,20,20,49,3,2,,63,104,76,1,2,17,0,0,29,41,30,76,,,7,7,13,15,16,15,40,41,35,89,74,,6,2,0,27,0,2,0,6,18,0,5,2,4,16,,,,,,,,,,,,,,,,,,,,,,,,,,,,,40,,,50,,
91,0,1,1,2,,,,,1,4.016427,1,2,1,26,2,2,2,2,2,6,2,1,1,2,2,2,2,1,2,3,,,,,,,,,106,60,64,1,2,106,0,0,37,21,19,,,,15,18,17,15,16,13,28,39,37,72,76,76,0,11,0,12,0,4,0,6,6,2,1,5,3,11,4,8,0,29,0,9,0,8,13,5,0,0,6,20,,,,,,,,,,,,,,,26,40,,46.153847,35,
92,0,1,1,1,2,1,2,2,2,4.224504,0,0,1,32,2,1,2,2,2,6,1,2,2,2,,,,,,0,27,36,40,35,71,,,,102,,,1,2,145,0,0,32,,,,,,7,,,18,,,30,,,83,,,3,7,0,17,0,11,0,9,4,0,0,0,21,15,,,,,,,,,,,,,,,,,,,,,,,,,,,,,40,,,10,,
93,1,1,2,2,,,,,2,3.2991102,0,0,1,40,6,2,2,2,2,6,1,2,1,2,2,2,2,1,1,0,35,28,20,33,62,1,,89,102,107,106,1,2,17,0,0,30,33,30,22,67,46,8,6,8,,17,14,36,28,19,79,81,76,11,4,0,26,1,5,0,14,9,1,3,0,14,16,7,0,0,14,0,10,0,8,0,0,0,1,24,2,,,,,,,,,,,,,,,40,40,,25,35,