ID,Age,Sex,Education_Years,GDS,MMSE,FSIQ,TrailsB_raw_secs,EAT_erraware,EAT_accuracy,Go_RT,No_Go_RT,PAL_totalerrorsadj,Ecog_Mem,Ecog_Lang,Ecog_Visuo,Ecog_Plan,Ecog_Org,Ecog_DivAtt,EM_composite,EF_composite,SCD_composite,Awareness_regressed
1,69,F,10,6,28,118.04,38.53,76.19,86,580.4,70.97,-1.130122951,18,12,10,7,7,6,1.622230363,1.134388945,0.966974755,0.424671296
2,69,F,15,6,30,119.7,23.79,85,86,485.81,68.09,0.92,11,11,9,5,8,7,-1.116756519,1.498205879,0.550941345,0.731480529
3,60,F,17,5,30,125.51,29.4,100,91.33,578.23,50.29,0.71,12,11,8,5,6,6,-0.456160592,1.591622759,0.409279451,1.164350501
4,75,M,16,1,30,123.85, ,52.63,87.33,691.46,90.1,1.03,17,11,8,6,7,4, , ,0.661786649,-0.418143025
5,67,F,12,2,29,119.7, ,77.08,64.67,464.77,166.62,0.87,18,20,11,5,7,5, , ,0.884708088,0.81386038
8,70,F,10,2,29,114.72,84.58,16.18,52.67,622.6,359.25,0.51,19,19,10,5,11,5,-0.300140607,-2.733498294,0.998362861,-1.105472888
9,70,F,10,0,30,121.36,49.83,96.15,82.67,548.83,119.28,0.74,16,18,9,7,8,6,-0.067274163,0.788783471,0.997831876,1.17570122
10,71,F,31,6,30,128,72.3,78.05,70.67,535.88,158.43,0.82,24,27,12,8,7,11,-0.620666155,-0.086411589,1.572136726,0.746882726
11,63,M,18,0,30,122.19,34.9,100,90.67,590.66,53.25,0.338150289,9,9,8,5,5,4,0.054145462,0.992487672,0.082898466,1.175433882
12,75,F,16,4,29,122.19,49.41,69.7,78,482.44,161.43,1.05,8,11,8,5,8,4,-1.324829014,0.694739822,0.279560359,0.333000339
13,70,M,17,5,29,126.34,63.58,75,67.33,582.92,181.33,0.46,19,11,9,5,6,5,-0.590885398,-0.728589161,0.653396195,0.696754762
14,66,F,16,1,30,121.36,39,69.23,82,599.26,123.37,0.98,15,13,8,5,11,6,-1.004695408,0.951146792,0.72804377,0.249460528
15,67,F,16,3,30,115.55,64,100,97.33,626.88,12.88,-0.26,21,20,10,5,6,6,0.982118761,1.017084743,0.939089074,1.063592488
16,73,M,16,8,30,125.51,57,27.78,87.33,556.67,119.67,0.78,20,22,13,5,12,7,-0.072342943,0.946458159,1.233834301,-1.283547047
17,64,M,13,0,30,123,41,10,79,614.3,125.27, ,15,9,9,5,6,5, , ,0.461527103,-1.762851823
18,69,M,15,2,30,121.36,27.34,54.72,62.66,519.47,306.26,-0.76,10,10,8,5,6,5,1.244954172,0.176077487,0.277019905,0.06892482
19,79,F,16,1,30,126,124,70.83,76,670.27,155.68,0.29,10,10,8,5,13,7,0.79170557,-0.78952946,0.561669905,0.405938719
20,64,M,18,1,30,125,48,25.49,64,592.53,305.2, ,9,12,7,5,7,8, , ,0.371081799,-0.971515814
21,78,F,12,3,27,98.95,88,65,58,754.4,325.19,0.59,11,15,9,5,6,5,-0.642126542,-2.098193729,0.465341345,0.505182356
22,69,M,17,1,30,120.53,23.97,74.06,80.67,594.36,101.35,0.97,11,11,8,5,6,5,-0.87514577,1.096686819,0.337124678,0.44000051
23,71,M,17,0,28,116.38,89,48.78,71.33,587.28,177.54,0.27,20,20,14,5,10,9,0.012001385,-1.127553248,1.239584301,-0.283531671
24,67,F,16,1,30,120.53,64.83,82.76,80.67,668.75,124.9,0.56,15,10,8,5,7,5,-0.566032689,0.358896987,0.496127103,0.74297898
25,75,F,14,1,29,123.85,76,69.14,69.65,670.32,215.83,0.75,8,9,8,5,6,4,-0.666742673,-0.580157427,0.127627026,0.453719844
26,71,M,18,3,29,124.68,58.73,80,76.66,569.76,222.95,0.78,19,15,10,5,6,11,-0.471666803,0.105500457,0.927712861,0.714201611
27,68,M,16,4,30,121.36,46,83.33,66.67,623.52,190.21,-0.24,14,9,10,5,6,6,0.607116245,0.137269724,0.505838997,0.997931323
28,63,M,15,3,30,123.02,45.7,72.73,92.67,578.36,117.34,0.74,18,13,13,8,8,8,-0.420564043,1.408329259,1.215041422,0.192167086
29,77,M,15,6,30,119.7,94,21.43,72,564.44,149.16,0.44,24,10,8,5,6,3,0.049450774,-1.356207565,0.617920059,-1.247249783
30,76,F,16,4,30,124.68,32.41,76.92,82.67,679.71,115.59,0.19,18,15,9,6,9,9,0.660471678,0.820501172,1.066308088,0.506014324
31,72,M,18,8,30,119.7,26.27,84.62,72,551.29,130.93,0.91,15,16,8,5,5,4,-0.440834391,0.752571732,0.433960436,0.953349016
32,70,M,18,0,29,123,36,0,100,643.6,6.54,1.08,5,8,7,5,6, ,-0.665345969,1.61349229,-0.007570626, 
33,77,M,16,9,30,123.85,39,83.33,85.19,668.27,97.91,1.12,18,16,11,6,8,5,-0.929416597,1.094780303,0.999041422,0.686924924
34,74,M,5,0,30,122,74,50,78,717.97,154.01,0.52,9,11,7,6,8,5,0.312955105,-0.022269182,0.414315132,-0.353054359
35,81,M,19,2,30,122.19,63,74,66,649.13,228.79,1.09,13,10,8,5,6,10,-0.107416076,-0.441620231,0.516634224,0.684264344
36,71,F,16,4,29,122,53,88.89,81,618.47,108.63,0.72,11,11,7,5,6,6,-0.421941799,0.317064495,0.303508011,0.950915223
37,70,F,17,0,30,120, ,5.26,79,629.54,178.99,0.29,12,9,8,8,6,7, , ,0.624279451,-1.927922852
38,64,F,13,0,30,120,79,47.37,60,590.77,307.83,-0.62,8,9,7,5,8,4,1.016211507,-0.94793702,0.148110359,-0.142370364
39,64,M,16,0,29,117,59,27.59,71,561.74,194.53,0.51,7,9,7,5,6,4,-0.49974244,-0.465322285,0.021855587,-1.015934094
40,65,M,13,1,29,122,61,72.22,50,579.15,292.83,0.45,19,16,16,9,10,7,-0.453253219,-1.326475113,1.422362861,0.890963678
41,63,M,16,0,29,125,72,46.67,85,667.29,135.24,0.11,12,16,9,7,7,8,0.184533525,0.007281201,0.856529451,-0.586572995
42,67,F,16,0,30,126,66,65,80,545.16,130.13,-0.05,7,10,7,5,6,5,0.262532511,-0.501717591,0.104772253,0.13573631
43,68,M,22,1,29,125,52,50,89,573.54,60.33,0.86,7,12,7,5,6,4,-0.518645492,0.898958798,0.10388892,-0.537777382
46,65,M,12,2,29,104,68,87.5,58,556.74,231.01,0.05,6,15,8,6,6,5,-0.037715005,-0.635209808,0.37196748,1.288747366
47,69,F,17,0,30,123, ,3.12,66,550.4,154.04,0.8,10,10,7,5,8,4, , ,0.246636572,-1.784139563
48,72,M,16,3,24,119, ,68.75,63,697.92,291.79,0.69,12,14,9,5,7,4, , ,0.484312784,0.551811514
49,72,M,11,0,28,102, ,11.36,55,657.65,286.64,0.57,8,12,7,5,6,5, , ,0.187993693,-1.312457621
50,71,M,16,0,30, , ,91.67,73.33,508.33,125.41,0.74,6,9,7,5,6,4, , ,-0.01138252,1.176531359
51,75,M,12,1,29,111, ,66.67,54,575.74,272.35,-0.45,9,10,7,6,7,5, , ,0.347348466,0.630512301
52,69,F,13,0,28,102,42,58.67,78.69,552.25,240.72,0.56,6,9,7,5,6,4,-0.623645033,0.285259506,-0.01138252,-0.062707813
53,68,F,12,1,30, ,47,46.88,67,542.43,321.22,0.1,6,13,7,5,6,8,-0.076069442,0.050129749,0.23876748,-0.276985684
54,62,M,21,2,30,123,44,72.73,88,653.15,150.67,-0.07,9,9,8,6,6,8,0.784993206,1.129995353,0.431848466,0.270590406
55,63,M,13,0,30,116,48,42.86,78,630.32,160.21,-0.7,7,11,7,5,6,4,1.521755252,0.371971315,0.080772253,-0.601705655
57,65,M,13,0,30,119, ,85,78,532.79,111.38,0.57,8,12,8,5,6,5, , ,0.260527026,0.865824546
58,61,F,19,0,30,122,52,22.73,78,624.87,350.06,1.09,8,13,7,5,9,6,-1.279872673,0.536014368,0.372543693,-1.302735151
59,76,M,16,1,30,120, ,0,90,684.33,53.23,0.52,9,15,11,5,6,4, , ,0.417965132,-2.295825961
60,69,F,18,1,30,123,46,21.95,57,632.9,373.15,0.51,22,14,9,5,7,6,-0.76764286,-0.502150239,0.90647718,-0.977245694
61,64,F,18,0,30,125,53,47.83,52,604.65,505.11,0.87,6,9,7,5,6,4,-1.56993019,-0.749939302,-0.01138252,0.007993204
63,75,F,16,1,28,126, ,5.13,59,662.35,239.85,0.39,10,14,8,7,6,4, , ,0.507786572,-1.596590074
64,64,F,16,0,30,119,87,29.63,71,632.45,344.07,-1.28,8,10,7,5,6,4,1.997216927,-0.751990691,0.087143693,-0.944890866
65,67,F,17,0,30,126,43,82.5,58,640.12,182.33,0.1,6,10,7,5,6,4,-0.022327011,-0.309590511,0.02066748,1.114621808
66,68,F,18,0,29,125,46,0,95,668.02,101.37,0.05,13,14,7,7,7,8,0.368933718,1.011445365,0.735684224,-2.379790972
67,66,M,17,0,30,126,54,2.08,52,582.68,225.67,0.92,8,17,9,5,8,7,-1.325682431,-0.916851006,0.557593693,-1.58525565
68,70,M,16,0,30,114,48,65,80,569.52,96.74,-0.07,7,11,8,5,8,5,1.579837063,0.773674815,0.29718892,0.13573631
69,68,F,15, ,30, ,56,73.08,74,650.37,150.77,-1.57,10,13,9,5,6,4,2.500047095,0.586987025,0.346819905,0.517881224
70,62,M,23,1,30,123.02,50.43,88.89,62,551.5,198.64,0.28,8,10,8,5,6,4,-0.445072686,-0.783786007,0.159677026,1.269982263
71,77,F,16,0,30,126.34,45.1,56.52,69.33,604.73,229.19,0.39,11,10,8,6,9,4,0.52075612,0.167399235,0.507891345,0.019600697
72,62,M,10,3,30,113.89,85.04,58.06,56,563.39,313.01,0.51,14,15,12,6,7,8,-0.987847733,-1.773334436,0.93442233,0.297082086
73,86,F,12,0,29,118.87,107,80,68.67,672.52,186.33,0.05,8,10,8,5,6,4,3.624631531,-1.177747091,0.159677026,0.848377697